BDBM341334 1-(5-(4-chloro-2-fluorophenyl)-2-methyl-7,8-dihydro-[1,3,4]thiadiazolo[2',3':2,3]imidazo[4,5-c]pyridin-6(5H)-yl)-2-((2-chloro-6-morpholinopyridin-3-yl)oxy)ethanone::US9765092, Example 1.4.4
SMILES: Cc1nn2c3C(N(CCc3nc2s1)C(=O)COc1ccc(nc1Cl)N1CCOCC1)c1ccc(Cl)cc1F
InChI Key: InChIKey=VOVGPNQIVNTARU-UHFFFAOYSA-N
Data: 1 IC50
Activity Spreadsheet -- Enzyme Inhibition Constant Data from BindingDB
Found 1 hit for monomerid = 341334
Trg + Lig
Ki
nM
ΔG°
kcal/mole
IC50
nM
Kd
nM
EC50/IC50
nM
koff
s-1
kon
M-1s-1
pHTemp
°C
Tryptophan 5-hydroxylase 1
(Homo sapiens (Human))
BDBM341334
(1-(5-(4-chloro-2-fluorophenyl)-2-methyl-7,8-dihydr...)
Show SMILES Cc1nn2c3C(N(CCc3nc2s1)C(=O)COc1ccc(nc1Cl)N1CCOCC1)c1ccc(Cl)cc1F
Show InChI InChI=1S/C25H23Cl2FN6O3S/c1-14-31-34-23-18(29-25(34)38-14)6-7-33(22(23)16-3-2-15(26)12-17(16)28)21(35)13-37-19-4-5-20(30-24(19)27)32-8-10-36-11-9-32/h2-5,12,22H,6-11,13H2,1H3
Reactome pathway
US Patent
n/an/a 5n/an/an/an/an/an/a
ACTELION PHARMACEUTICALS LTD
US Patent
Assay Description
To generate the enzyme, full length human TPH1 is cloned into the plasmid pET20b(+) (Novagen) and expressed in E. coli. The bacterial cells are ruptu...
US Patent US9765092 (2017)
BindingDB Entry DOI: 10.7270/Q21N838B