BDBM34145 pyrrolidinylindole, (R)-5b
SMILES: [H][C@]1(Cc2c[nH]c3ccc(NS(=O)(=O)c4ccc(cc4)C(F)(F)F)cc23)CCCN1C
InChI Key: InChIKey=YUOITHDJQWZYHP-QGZVFWFLSA-N
Data: 3 KI  1 IC50  2 EC50
Activity Spreadsheet -- Enzyme Inhibition Constant Data from BindingDB
Found 5 hits for monomerid = 34145
Trg + Lig
Ki
nM
ΔG°
kcal/mole
IC50
nM
Kd
nM
EC50/IC50
nM
koff
s-1
kon
M-1s-1
pHTemp
°C
5-hydroxytryptamine receptor 6
(Homo sapiens (Human))
BDBM34145
(pyrrolidinylindole, (R)-5b)
Show SMILES [H][C@]1(Cc2c[nH]c3ccc(NS(=O)(=O)c4ccc(cc4)C(F)(F)F)cc23)CCCN1C |r|
Show InChI InChI=1S/C21H22F3N3O2S/c1-27-10-2-3-17(27)11-14-13-25-20-9-6-16(12-19(14)20)26-30(28,29)18-7-4-15(5-8-18)21(22,23)24/h4-9,12-13,17,25-26H,2-3,10-11H2,1H3/t17-/m1/s1
Reactome pathway
0.400 -13.3n/an/a 4.5n/an/a7.437
Universitat de Barcelona
Assay Description
Radioligand binding assays were performed using membranes from HEK-293 transfected with human 5-HT6 receptor. In these membranes the receptor concent...
Bioorg Med Chem 17: 7387-97 (2009)
Article DOI: 10.1016/j.bmc.2009.08.006
BindingDB Entry DOI: 10.7270/Q2RR1WKS
5-hydroxytryptamine receptor 6
(Homo sapiens (Human))
BDBM34145
(pyrrolidinylindole, (R)-5b)
Show SMILES [H][C@]1(Cc2c[nH]c3ccc(NS(=O)(=O)c4ccc(cc4)C(F)(F)F)cc23)CCCN1C |r|
Show InChI InChI=1S/C21H22F3N3O2S/c1-27-10-2-3-17(27)11-14-13-25-20-9-6-16(12-19(14)20)26-30(28,29)18-7-4-15(5-8-18)21(22,23)24/h4-9,12-13,17,25-26H,2-3,10-11H2,1H3/t17-/m1/s1
Reactome pathway
0.400n/an/an/an/an/an/an/an/a
Wyeth Research
Curated by ChEMBL
Assay Description
Inhibition of [3H]LSD binding to human 5-hydroxytryptamine 6 receptor expressed in HeLa cells
J Med Chem 48: 353-6 (2005)
Article DOI: 10.1021/jm049243i
BindingDB Entry DOI: 10.7270/Q27W6D00
5-hydroxytryptamine receptor 6
(Homo sapiens (Human))
BDBM34145
(pyrrolidinylindole, (R)-5b)
Show SMILES [H][C@]1(Cc2c[nH]c3ccc(NS(=O)(=O)c4ccc(cc4)C(F)(F)F)cc23)CCCN1C |r|
Show InChI InChI=1S/C21H22F3N3O2S/c1-27-10-2-3-17(27)11-14-13-25-20-9-6-16(12-19(14)20)26-30(28,29)18-7-4-15(5-8-18)21(22,23)24/h4-9,12-13,17,25-26H,2-3,10-11H2,1H3/t17-/m1/s1
Reactome pathway
10n/an/an/an/an/an/an/an/a
Wyeth Research
Curated by ChEMBL
Assay Description
Inhibition of [3H]LSD binding to human 5-hydroxytryptamine 6 receptor expressed in HeLa cells
J Med Chem 48: 353-6 (2005)
Article DOI: 10.1021/jm049243i
BindingDB Entry DOI: 10.7270/Q27W6D00
5-hydroxytryptamine receptor 6
(Homo sapiens (Human))
BDBM34145
(pyrrolidinylindole, (R)-5b)
Show SMILES [H][C@]1(Cc2c[nH]c3ccc(NS(=O)(=O)c4ccc(cc4)C(F)(F)F)cc23)CCCN1C |r|
Show InChI InChI=1S/C21H22F3N3O2S/c1-27-10-2-3-17(27)11-14-13-25-20-9-6-16(12-19(14)20)26-30(28,29)18-7-4-15(5-8-18)21(22,23)24/h4-9,12-13,17,25-26H,2-3,10-11H2,1H3/t17-/m1/s1
Reactome pathway
n/an/an/an/a 4.5n/an/an/an/a
Wyeth Research
Curated by ChEMBL
Assay Description
Effective agonist concentration in cAMP release assay in HeLa cells expressing human 5-hydroxytryptamine 6 receptor
J Med Chem 48: 353-6 (2005)
Article DOI: 10.1021/jm049243i
BindingDB Entry DOI: 10.7270/Q27W6D00
5-hydroxytryptamine receptor 6
(Homo sapiens (Human))
BDBM34145
(pyrrolidinylindole, (R)-5b)
Show SMILES [H][C@]1(Cc2c[nH]c3ccc(NS(=O)(=O)c4ccc(cc4)C(F)(F)F)cc23)CCCN1C |r|
Show InChI InChI=1S/C21H22F3N3O2S/c1-27-10-2-3-17(27)11-14-13-25-20-9-6-16(12-19(14)20)26-30(28,29)18-7-4-15(5-8-18)21(22,23)24/h4-9,12-13,17,25-26H,2-3,10-11H2,1H3/t17-/m1/s1
Reactome pathway
n/an/a 21.6n/an/an/an/an/an/a
Wyeth Research
Curated by ChEMBL
Assay Description
Inhibition of 5-HT stimulated cAMP production in HeLa cells expressing human 5-hydroxytryptamine 6 receptor
J Med Chem 48: 353-6 (2005)
Article DOI: 10.1021/jm049243i
BindingDB Entry DOI: 10.7270/Q27W6D00