BDBM341451 2-((2-chloro-6-morpholinopyridin-3-yl)oxy)-1-(5-(3-fluorothiophen-2-yl)-2-methyl-7,8-dihydro-[1,3,4]thiadiazolo[2',3':2,3]imidazo[4,5-c]pyridin-6(5H)-yl)ethanone::US9765092, Example 1.23.1
SMILES: Cc1nn2c3C(N(CCc3nc2s1)C(=O)COc1ccc(nc1Cl)N1CCOCC1)c1sccc1F
InChI Key: InChIKey=GZJPDVRMJFWULZ-UHFFFAOYSA-N
Data: 1 IC50
Activity Spreadsheet -- Enzyme Inhibition Constant Data from BindingDB
Found 1 hit for monomerid = 341451
Trg + Lig
Ki
nM
ΔG°
kcal/mole
IC50
nM
Kd
nM
EC50/IC50
nM
koff
s-1
kon
M-1s-1
pHTemp
°C
Tryptophan 5-hydroxylase 1
(Homo sapiens (Human))
BDBM341451
(2-((2-chloro-6-morpholinopyridin-3-yl)oxy)-1-(5-(3...)
Show SMILES Cc1nn2c3C(N(CCc3nc2s1)C(=O)COc1ccc(nc1Cl)N1CCOCC1)c1sccc1F
Show InChI InChI=1S/C23H22ClFN6O3S2/c1-13-28-31-19-15(26-23(31)36-13)4-6-30(20(19)21-14(25)5-11-35-21)18(32)12-34-16-2-3-17(27-22(16)24)29-7-9-33-10-8-29/h2-3,5,11,20H,4,6-10,12H2,1H3
Reactome pathway
US Patent
n/an/a 2n/an/an/an/an/an/a
ACTELION PHARMACEUTICALS LTD
US Patent
Assay Description
To generate the enzyme, full length human TPH1 is cloned into the plasmid pET20b(+) (Novagen) and expressed in E. coli. The bacterial cells are ruptu...
US Patent US9765092 (2017)
BindingDB Entry DOI: 10.7270/Q21N838B