BDBM341760 2-(6-(2-((2-Chloro-6-morpholinopyridin-3-yl)oxy)acetyl)-2-methyl-5,6,7,8-tetrahydro-[1,3,4]thiadiazolo[2',3':2,3]imidazo[4,5-c]pyridin-5-yl)thiazole-4-carboxamide::US9765092, Example 1.48.1
SMILES: Cc1nn2c3C(N(CCc3nc2s1)C(=O)COc1ccc(nc1Cl)N1CCOCC1)c1nc(cs1)C(N)=O
InChI Key: InChIKey=SJIKNMDQDPGRCW-UHFFFAOYSA-N
Data: 1 IC50
Activity Spreadsheet -- Enzyme Inhibition Constant Data from BindingDB
Found 1 hit for monomerid = 341760
Trg + Lig
Ki
nM
ΔG°
kcal/mole
IC50
nM
Kd
nM
EC50/IC50
nM
koff
s-1
kon
M-1s-1
pHTemp
°C
Tryptophan 5-hydroxylase 1
(Homo sapiens (Human))
BDBM341760
(2-(6-(2-((2-Chloro-6-morpholinopyridin-3-yl)oxy)ac...)
Show SMILES Cc1nn2c3C(N(CCc3nc2s1)C(=O)COc1ccc(nc1Cl)N1CCOCC1)c1nc(cs1)C(N)=O
Show InChI InChI=1S/C23H23ClN8O4S2/c1-12-29-32-18-13(27-23(32)38-12)4-5-31(19(18)22-26-14(11-37-22)21(25)34)17(33)10-36-15-2-3-16(28-20(15)24)30-6-8-35-9-7-30/h2-3,11,19H,4-10H2,1H3,(H2,25,34)
Reactome pathway
US Patent
n/an/a 5n/an/an/an/an/an/a
ACTELION PHARMACEUTICALS LTD
US Patent
Assay Description
To generate the enzyme, full length human TPH1 is cloned into the plasmid pET20b(+) (Novagen) and expressed in E. coli. The bacterial cells are ruptu...
US Patent US9765092 (2017)
BindingDB Entry DOI: 10.7270/Q21N838B