BDBM342434 5-chloro-4-(cyclohexylmethoxy)-2-fluoro-N-(methylsulfonyl)benzamide::US9771376, Example 21
SMILES: CS(=O)(=O)NC(=O)c1cnc(OCC23CC4CC5(CC(C5)(C4)C2)C3)c(Cl)c1
InChI Key: InChIKey=XHHQCYBSLDIPNZ-UHFFFAOYSA-N
Data: 1 IC50
Activity Spreadsheet -- Enzyme Inhibition Constant Data from BindingDB
Found 1 hit for monomerid = 342434
Trg + Lig
Ki
nM
ΔG°
kcal/mole
IC50
nM
Kd
nM
EC50/IC50
nM
koff
s-1
kon
M-1s-1
pHTemp
°C
Sodium channel protein type 9 subunit alpha
(Homo sapiens (Human))
BDBM342434
(5-chloro-4-(cyclohexylmethoxy)-2-fluoro-N-(methyls...)
Show SMILES CS(=O)(=O)NC(=O)c1cnc(OCC23CC4CC5(CC(C5)(C4)C2)C3)c(Cl)c1 |TLB:16:17:22:15.21.14,14:13:18:20,THB:16:15:22:18.23.17,20:17:22:15.21.14,12:13:18:20,(6.38,2.1,;5.61,3.43,;6.95,4.2,;4.84,4.77,;4.28,2.66,;2.94,3.43,;2.94,4.97,;1.61,2.66,;.28,3.43,;-1.06,2.66,;-1.06,1.12,;-2.39,.35,;-3.93,.35,;-4.7,-.98,;-6.17,-.57,;-6.94,-1.9,;-6.95,-3.44,;-5.46,-3.86,;-4.37,-4.95,;-4.39,-3.43,;-4.4,-4.97,;-5.87,-3.02,;-3.61,-2.07,;-4.7,-2.52,;.28,.35,;.28,-1.19,;1.61,1.12,)|
Show InChI InChI=1S/C19H23ClN2O4S/c1-27(24,25)22-15(23)13-2-14(20)16(21-6-13)26-11-19-5-12-3-17(9-19)7-18(4-12,8-17)10-19/h2,6,12H,3-5,7-11H2,1H3,(H,22,23)
US Patent
n/an/a 106n/an/an/an/an/an/a
GENENTECH, INC.; XENON PHARMACEUTICALS INC.
US Patent
Assay Description
The following patch voltage clamp electrophysiology studies were performed on representative compounds of the invention using human embryonic kidney ...
US Patent US9771376 (2017)
BindingDB Entry DOI: 10.7270/Q2W0983R