BDBM342449 N-{2-[(4aR,6R,8aR)-2- amino-6-(trifluoromethyl)- 4,4a,5,6-tetrahydropyrano [3,4-d][1,3]oxazin-8a(8H)-yl]- 1,3-thiazol-4-yl}-5-cyano pyridine-2-carboxamide::US9771379, Example 24
SMILES: NC1=N[C@]2(CO[C@H](C[C@H]2CO1)C(F)(F)F)c1nc(NC(=O)c2ccc(cn2)C#N)cs1
InChI Key: InChIKey=YCNVYNANCSXFEX-BFCNOCSMSA-N
Data: 1 IC50
Activity Spreadsheet -- Enzyme Inhibition Constant Data from BindingDB
Found 1 hit for monomerid = 342449
Trg + Lig
Ki
nM
ΔG°
kcal/mole
IC50
nM
Kd
nM
EC50/IC50
nM
koff
s-1
kon
M-1s-1
pHTemp
°C
Beta-secretase 1
(Homo sapiens (Human))
BDBM342449
(N-{2-[(4aR,6R,8aR)-2- amino-6-(trifluoromethyl)- 4...)
Show SMILES NC1=N[C@]2(CO[C@H](C[C@H]2CO1)C(F)(F)F)c1nc(NC(=O)c2ccc(cn2)C#N)cs1 |r,t:1|
Show InChI InChI=1S/C18H15F3N6O3S/c19-18(20,21)12-3-10-6-29-16(23)27-17(10,8-30-12)15-26-13(7-31-15)25-14(28)11-2-1-9(4-22)5-24-11/h1-2,5,7,10,12H,3,6,8H2,(H2,23,27)(H,25,28)/t10-,12+,17-/m0/s1
US Patent
n/an/a 27n/an/an/an/an/an/a
PFIZER INC.
US Patent
Assay Description
The BACE1 binding assay measured beta-site amyloid precursor protein-cleaving enzyme (BACE) binding as a decrease in the counts of radioligand bound ...
US Patent US9771379 (2017)
BindingDB Entry DOI: 10.7270/Q2R78HC1