BDBM3425 5-chloro-2-(4-{2-[(1-ethylcyclopentyl)(2-hydroxyethyl)carbamoyl]phenyl}-2-hydroxybutyl)-N-(2-hydroxyethyl)-N-(2-phenylpropan-2-yl)benzamide::Tertiary Amide deriv. 43cb::diarylbutanol deriv. 13
SMILES: CCC1(CCCC1)N(CCO)C(=O)c1ccccc1CCC(O)Cc1ccc(Cl)cc1C(=O)N(CCO)C(C)(C)c1ccccc1
InChI Key: InChIKey=NNOAGIUJEAGRGK-UHFFFAOYSA-N
Data: 2 KI
Activity Spreadsheet -- Enzyme Inhibition Constant Data from BindingDB
Found 2 hits for monomerid = 3425
Trg + Lig
Ki
nM
ΔG°
kcal/mole
IC50
nM
Kd
nM
EC50/IC50
nM
koff
s-1
kon
M-1s-1
pHTemp
°C
HIV-1 Protease
(Human immunodeficiency virus type 1)
BDBM3425
(5-chloro-2-(4-{2-[(1-ethylcyclopentyl)(2-hydroxyet...)
Show SMILES CCC1(CCCC1)N(CCO)C(=O)c1ccccc1CCC(O)Cc1ccc(Cl)cc1C(=O)N(CCO)C(C)(C)c1ccccc1
Show InChI InChI=1S/C38H49ClN2O5/c1-4-38(20-10-11-21-38)41(23-25-43)35(45)33-15-9-8-12-28(33)17-19-32(44)26-29-16-18-31(39)27-34(29)36(46)40(22-24-42)37(2,3)30-13-6-5-7-14-30/h5-9,12-16,18,27,32,42-44H,4,10-11,17,19-26H2,1-3H3
2n/an/an/an/an/an/an/an/a
Agouron Pharmaceuticals, Inc.
Assay Description
Protease activity was measured by continuous chromogenic assay. The chromogenic peptide His-Lys-Ala-Arg-Val-Leu-(p-NO2-Phe)-Glu-Ala-Nleu-Ser was use...
J Med Chem 39: 2795-811 (1996)
Article DOI: 10.1021/jm960092w
BindingDB Entry DOI: 10.7270/Q2028PRG
HIV-1 Protease
(Human immunodeficiency virus type 1)
BDBM3425
(5-chloro-2-(4-{2-[(1-ethylcyclopentyl)(2-hydroxyet...)
Show SMILES CCC1(CCCC1)N(CCO)C(=O)c1ccccc1CCC(O)Cc1ccc(Cl)cc1C(=O)N(CCO)C(C)(C)c1ccccc1
Show InChI InChI=1S/C38H49ClN2O5/c1-4-38(20-10-11-21-38)41(23-25-43)35(45)33-15-9-8-12-28(33)17-19-32(44)26-29-16-18-31(39)27-34(29)36(46)40(22-24-42)37(2,3)30-13-6-5-7-14-30/h5-9,12-16,18,27,32,42-44H,4,10-11,17,19-26H2,1-3H3
2 -12.3n/an/an/an/an/a5.637
Agouron Pharmaceuticals, Inc.
Assay Description
Protease activity was measured by continuous chromogenic assay. The chromogenic peptide His-Lys-Ala-Arg-Val-Leu- (p-NO2-Phe)-Glu-Ala-Nleu-Ser (Bache...
Proc Natl Acad Sci U S A 92: 3298-302 (1995)
Article DOI: 10.1073/pnas.92.8.3298
BindingDB Entry DOI: 10.7270/Q2F769RX