BDBM3428 1-[2-amino-6-(2,6-dichlorophenyl)pyrido[2,3-d]pyrimidin-7-yl]-3-tert-butylurea::6-arylpyrido[2,3-d]pyrimidine deriv. 1::CHEMBL57366::PD089828
SMILES: CC(C)(C)NC(=O)Nc1nc2nc(N)ncc2cc1-c1c(Cl)cccc1Cl
InChI Key: InChIKey=RRWSNCZYJCOEFX-UHFFFAOYSA-N
Data: 19 IC50
Activity Spreadsheet -- Enzyme Inhibition Constant Data from BindingDB
Found 19 hits for monomerid = 3428
Trg + Lig
Ki
nM
ΔG°
kcal/mole
IC50
nM
Kd
nM
EC50/IC50
nM
koff
s-1
kon
M-1s-1
pHTemp
°C
Platelet-derived growth factor receptor beta
(Homo sapiens (Human))
BDBM3428
(1-[2-amino-6-(2,6-dichlorophenyl)pyrido[2,3-d]pyri...)
Show SMILES CC(C)(C)NC(=O)Nc1nc2nc(N)ncc2cc1-c1c(Cl)cccc1Cl |(4.56,-3.94,;3.23,-3.17,;1.89,-3.94,;3.23,-4.71,;3.23,-1.63,;1.89,-.86,;.56,-1.63,;1.89,.68,;.56,1.45,;-.77,.68,;-2.11,1.45,;-3.44,.68,;-4.78,1.45,;-6.11,.68,;-4.78,2.99,;-3.44,3.76,;-2.11,2.99,;-.77,3.76,;.56,2.99,;1.89,3.76,;1.89,5.3,;.56,6.07,;3.23,6.07,;4.56,5.3,;4.56,3.76,;3.23,2.99,;3.23,1.45,)|
Show InChI InChI=1S/C18H18Cl2N6O/c1-18(2,3)26-17(27)25-15-10(13-11(19)5-4-6-12(13)20)7-9-8-22-16(21)24-14(9)23-15/h4-8H,1-3H3,(H4,21,22,23,24,25,26,27)
NCI pathway
Reactome pathway
n/an/a 1.20E+3n/an/an/an/a7.425
Pfizer
Assay Description
IC50 is the inhibitor concentration which inhibits 50% of kinase activity that catalyzes the transfer of the terminal phosphate from [gamma-32P] labe...
J Med Chem 44: 1915-26 (2001)
Article DOI: 10.1021/jm0004291
BindingDB Entry DOI: 10.7270/Q29K48DG
PDGFR-beta/Platelet-derived growth factor receptor alpha
(Homo sapiens (Human))
BDBM3428
(1-[2-amino-6-(2,6-dichlorophenyl)pyrido[2,3-d]pyri...)
Show SMILES CC(C)(C)NC(=O)Nc1nc2nc(N)ncc2cc1-c1c(Cl)cccc1Cl |(4.56,-3.94,;3.23,-3.17,;1.89,-3.94,;3.23,-4.71,;3.23,-1.63,;1.89,-.86,;.56,-1.63,;1.89,.68,;.56,1.45,;-.77,.68,;-2.11,1.45,;-3.44,.68,;-4.78,1.45,;-6.11,.68,;-4.78,2.99,;-3.44,3.76,;-2.11,2.99,;-.77,3.76,;.56,2.99,;1.89,3.76,;1.89,5.3,;.56,6.07,;3.23,6.07,;4.56,5.3,;4.56,3.76,;3.23,2.99,;3.23,1.45,)|
Show InChI InChI=1S/C18H18Cl2N6O/c1-18(2,3)26-17(27)25-15-10(13-11(19)5-4-6-12(13)20)7-9-8-22-16(21)24-14(9)23-15/h4-8H,1-3H3,(H4,21,22,23,24,25,26,27)
Reactome pathway
n/an/a 1.25E+3n/an/an/an/an/an/a
Parke-Davis Pharmaceutical Research
Assay Description
Inhibitory activity against platelet-derived growth factor receptor
Bioorg Med Chem Lett 7: 2415-20 (1997)
Article DOI: 10.1074/jbc.M606873200
BindingDB Entry DOI: 10.7270/Q28C9TF2
Proto-oncogene tyrosine-protein kinase Src
(Homo sapiens (Human))
BDBM3428
(1-[2-amino-6-(2,6-dichlorophenyl)pyrido[2,3-d]pyri...)
Show SMILES CC(C)(C)NC(=O)Nc1nc2nc(N)ncc2cc1-c1c(Cl)cccc1Cl |(4.56,-3.94,;3.23,-3.17,;1.89,-3.94,;3.23,-4.71,;3.23,-1.63,;1.89,-.86,;.56,-1.63,;1.89,.68,;.56,1.45,;-.77,.68,;-2.11,1.45,;-3.44,.68,;-4.78,1.45,;-6.11,.68,;-4.78,2.99,;-3.44,3.76,;-2.11,2.99,;-.77,3.76,;.56,2.99,;1.89,3.76,;1.89,5.3,;.56,6.07,;3.23,6.07,;4.56,5.3,;4.56,3.76,;3.23,2.99,;3.23,1.45,)|
Show InChI InChI=1S/C18H18Cl2N6O/c1-18(2,3)26-17(27)25-15-10(13-11(19)5-4-6-12(13)20)7-9-8-22-16(21)24-14(9)23-15/h4-8H,1-3H3,(H4,21,22,23,24,25,26,27)
n/an/a 220n/an/an/an/a7.425
Pfizer
Assay Description
IC50 is the inhibitor concentration which inhibits 50% of kinase activity that catalyzes the transfer of the terminal phosphate from [gamma-32P] labe...
J Med Chem 44: 1915-26 (2001)
Article DOI: 10.1021/jm0004291
BindingDB Entry DOI: 10.7270/Q29K48DG
Platelet-derived growth factor receptor beta
(Homo sapiens (Human))
BDBM3428
(1-[2-amino-6-(2,6-dichlorophenyl)pyrido[2,3-d]pyri...)
Show SMILES CC(C)(C)NC(=O)Nc1nc2nc(N)ncc2cc1-c1c(Cl)cccc1Cl |(4.56,-3.94,;3.23,-3.17,;1.89,-3.94,;3.23,-4.71,;3.23,-1.63,;1.89,-.86,;.56,-1.63,;1.89,.68,;.56,1.45,;-.77,.68,;-2.11,1.45,;-3.44,.68,;-4.78,1.45,;-6.11,.68,;-4.78,2.99,;-3.44,3.76,;-2.11,2.99,;-.77,3.76,;.56,2.99,;1.89,3.76,;1.89,5.3,;.56,6.07,;3.23,6.07,;4.56,5.3,;4.56,3.76,;3.23,2.99,;3.23,1.45,)|
Show InChI InChI=1S/C18H18Cl2N6O/c1-18(2,3)26-17(27)25-15-10(13-11(19)5-4-6-12(13)20)7-9-8-22-16(21)24-14(9)23-15/h4-8H,1-3H3,(H4,21,22,23,24,25,26,27)
NCI pathway
Reactome pathway
n/an/a 1.25E+3n/an/an/an/a7.425
Parke-Davis Pharmaceutical Research
Assay Description
The kinase activity is the enzyme activity that catalyzes the transfer of the terminal phosphate from [gamma-32P] ATP to the poly (E: Y) substrate. N...
Bioorg Med Chem Lett 7: 2415-20 (1997)
Article DOI: 10.1074/jbc.M606873200
BindingDB Entry DOI: 10.7270/Q28C9TF2
Fibroblast growth factor receptor 1
(Homo sapiens (Human))
BDBM3428
(1-[2-amino-6-(2,6-dichlorophenyl)pyrido[2,3-d]pyri...)
Show SMILES CC(C)(C)NC(=O)Nc1nc2nc(N)ncc2cc1-c1c(Cl)cccc1Cl |(4.56,-3.94,;3.23,-3.17,;1.89,-3.94,;3.23,-4.71,;3.23,-1.63,;1.89,-.86,;.56,-1.63,;1.89,.68,;.56,1.45,;-.77,.68,;-2.11,1.45,;-3.44,.68,;-4.78,1.45,;-6.11,.68,;-4.78,2.99,;-3.44,3.76,;-2.11,2.99,;-.77,3.76,;.56,2.99,;1.89,3.76,;1.89,5.3,;.56,6.07,;3.23,6.07,;4.56,5.3,;4.56,3.76,;3.23,2.99,;3.23,1.45,)|
Show InChI InChI=1S/C18H18Cl2N6O/c1-18(2,3)26-17(27)25-15-10(13-11(19)5-4-6-12(13)20)7-9-8-22-16(21)24-14(9)23-15/h4-8H,1-3H3,(H4,21,22,23,24,25,26,27)
NCI pathway
Reactome pathway
n/an/a 140n/an/an/an/an/an/a
Parke-Davis Pharmaceutical Research
Assay Description
The kinase activity is the enzyme activity that catalyzes the transfer of the terminal phosphate from [gamma-32P] ATP to the poly (E: Y) substrate. N...
Bioorg Med Chem Lett 7: 2415-20 (1997)
Article DOI: 10.1074/jbc.M606873200
BindingDB Entry DOI: 10.7270/Q28C9TF2
Proto-oncogene tyrosine-protein kinase Src
(Homo sapiens (Human))
BDBM3428
(1-[2-amino-6-(2,6-dichlorophenyl)pyrido[2,3-d]pyri...)
Show SMILES CC(C)(C)NC(=O)Nc1nc2nc(N)ncc2cc1-c1c(Cl)cccc1Cl |(4.56,-3.94,;3.23,-3.17,;1.89,-3.94,;3.23,-4.71,;3.23,-1.63,;1.89,-.86,;.56,-1.63,;1.89,.68,;.56,1.45,;-.77,.68,;-2.11,1.45,;-3.44,.68,;-4.78,1.45,;-6.11,.68,;-4.78,2.99,;-3.44,3.76,;-2.11,2.99,;-.77,3.76,;.56,2.99,;1.89,3.76,;1.89,5.3,;.56,6.07,;3.23,6.07,;4.56,5.3,;4.56,3.76,;3.23,2.99,;3.23,1.45,)|
Show InChI InChI=1S/C18H18Cl2N6O/c1-18(2,3)26-17(27)25-15-10(13-11(19)5-4-6-12(13)20)7-9-8-22-16(21)24-14(9)23-15/h4-8H,1-3H3,(H4,21,22,23,24,25,26,27)
n/an/a 220n/an/an/an/an/an/a
Parke-Davis Pharmaceutical Research
Assay Description
The kinase activity is the enzyme activity that catalyzes the transfer of the terminal phosphate from [gamma-32P] labeled ATP to the poly (E: Y) subs...
Bioorg Med Chem Lett 7: 2415-20 (1997)
Article DOI: 10.1074/jbc.M606873200
BindingDB Entry DOI: 10.7270/Q28C9TF2
Insulin receptor
(Homo sapiens (Human))
BDBM3428
(1-[2-amino-6-(2,6-dichlorophenyl)pyrido[2,3-d]pyri...)
Show SMILES CC(C)(C)NC(=O)Nc1nc2nc(N)ncc2cc1-c1c(Cl)cccc1Cl |(4.56,-3.94,;3.23,-3.17,;1.89,-3.94,;3.23,-4.71,;3.23,-1.63,;1.89,-.86,;.56,-1.63,;1.89,.68,;.56,1.45,;-.77,.68,;-2.11,1.45,;-3.44,.68,;-4.78,1.45,;-6.11,.68,;-4.78,2.99,;-3.44,3.76,;-2.11,2.99,;-.77,3.76,;.56,2.99,;1.89,3.76,;1.89,5.3,;.56,6.07,;3.23,6.07,;4.56,5.3,;4.56,3.76,;3.23,2.99,;3.23,1.45,)|
Show InChI InChI=1S/C18H18Cl2N6O/c1-18(2,3)26-17(27)25-15-10(13-11(19)5-4-6-12(13)20)7-9-8-22-16(21)24-14(9)23-15/h4-8H,1-3H3,(H4,21,22,23,24,25,26,27)
n/an/a>5.00E+4n/an/an/an/an/an/a
Parke-Davis Pharmaceutical Research
Curated by ChEMBL
Assay Description
Inhibition of insulin receptor (InsR) tyrosine kinase
J Med Chem 40: 2296-303 (1997)
Article DOI: 10.1021/jm970367n
BindingDB Entry DOI: 10.7270/Q2Z31XRR
Proto-oncogene tyrosine-protein kinase Src
(Homo sapiens (Human))
BDBM3428
(1-[2-amino-6-(2,6-dichlorophenyl)pyrido[2,3-d]pyri...)
Show SMILES CC(C)(C)NC(=O)Nc1nc2nc(N)ncc2cc1-c1c(Cl)cccc1Cl |(4.56,-3.94,;3.23,-3.17,;1.89,-3.94,;3.23,-4.71,;3.23,-1.63,;1.89,-.86,;.56,-1.63,;1.89,.68,;.56,1.45,;-.77,.68,;-2.11,1.45,;-3.44,.68,;-4.78,1.45,;-6.11,.68,;-4.78,2.99,;-3.44,3.76,;-2.11,2.99,;-.77,3.76,;.56,2.99,;1.89,3.76,;1.89,5.3,;.56,6.07,;3.23,6.07,;4.56,5.3,;4.56,3.76,;3.23,2.99,;3.23,1.45,)|
Show InChI InChI=1S/C18H18Cl2N6O/c1-18(2,3)26-17(27)25-15-10(13-11(19)5-4-6-12(13)20)7-9-8-22-16(21)24-14(9)23-15/h4-8H,1-3H3,(H4,21,22,23,24,25,26,27)
n/an/a 220n/an/an/an/an/an/a
Parke-Davis Pharmaceutical Research
Curated by ChEMBL
Assay Description
Inhibition of C-src tyrosine kinase
J Med Chem 40: 2296-303 (1997)
Article DOI: 10.1021/jm970367n
BindingDB Entry DOI: 10.7270/Q2Z31XRR
Epidermal growth factor receptor
(Homo sapiens (Human))
BDBM3428
(1-[2-amino-6-(2,6-dichlorophenyl)pyrido[2,3-d]pyri...)
Show SMILES CC(C)(C)NC(=O)Nc1nc2nc(N)ncc2cc1-c1c(Cl)cccc1Cl |(4.56,-3.94,;3.23,-3.17,;1.89,-3.94,;3.23,-4.71,;3.23,-1.63,;1.89,-.86,;.56,-1.63,;1.89,.68,;.56,1.45,;-.77,.68,;-2.11,1.45,;-3.44,.68,;-4.78,1.45,;-6.11,.68,;-4.78,2.99,;-3.44,3.76,;-2.11,2.99,;-.77,3.76,;.56,2.99,;1.89,3.76,;1.89,5.3,;.56,6.07,;3.23,6.07,;4.56,5.3,;4.56,3.76,;3.23,2.99,;3.23,1.45,)|
Show InChI InChI=1S/C18H18Cl2N6O/c1-18(2,3)26-17(27)25-15-10(13-11(19)5-4-6-12(13)20)7-9-8-22-16(21)24-14(9)23-15/h4-8H,1-3H3,(H4,21,22,23,24,25,26,27)
n/an/a 450n/an/an/an/an/an/a
Parke-Davis Pharmaceutical Research
Curated by ChEMBL
Assay Description
Inhibition of Epidermal growth factor receptor (EGFr) tyrosine kinase
J Med Chem 40: 2296-303 (1997)
Article DOI: 10.1021/jm970367n
BindingDB Entry DOI: 10.7270/Q2Z31XRR
Fibroblast growth factor receptor 4
(Homo sapiens (Human))
BDBM3428
(1-[2-amino-6-(2,6-dichlorophenyl)pyrido[2,3-d]pyri...)
Show SMILES CC(C)(C)NC(=O)Nc1nc2nc(N)ncc2cc1-c1c(Cl)cccc1Cl |(4.56,-3.94,;3.23,-3.17,;1.89,-3.94,;3.23,-4.71,;3.23,-1.63,;1.89,-.86,;.56,-1.63,;1.89,.68,;.56,1.45,;-.77,.68,;-2.11,1.45,;-3.44,.68,;-4.78,1.45,;-6.11,.68,;-4.78,2.99,;-3.44,3.76,;-2.11,2.99,;-.77,3.76,;.56,2.99,;1.89,3.76,;1.89,5.3,;.56,6.07,;3.23,6.07,;4.56,5.3,;4.56,3.76,;3.23,2.99,;3.23,1.45,)|
Show InChI InChI=1S/C18H18Cl2N6O/c1-18(2,3)26-17(27)25-15-10(13-11(19)5-4-6-12(13)20)7-9-8-22-16(21)24-14(9)23-15/h4-8H,1-3H3,(H4,21,22,23,24,25,26,27)
n/an/a 560n/an/an/an/an/an/a
Health Science Center Xi'an Jiaotong University
Curated by ChEMBL
Assay Description
Inhibition of FGFR4 (unknown origin) after 90 mins by TR-FRET assay
Bioorg Med Chem Lett 25: 1556-60 (2015)
Article DOI: 10.1016/j.bmcl.2015.02.010
BindingDB Entry DOI: 10.7270/Q2NP262J
Fibroblast growth factor receptor 3
(Homo sapiens (Human))
BDBM3428
(1-[2-amino-6-(2,6-dichlorophenyl)pyrido[2,3-d]pyri...)
Show SMILES CC(C)(C)NC(=O)Nc1nc2nc(N)ncc2cc1-c1c(Cl)cccc1Cl |(4.56,-3.94,;3.23,-3.17,;1.89,-3.94,;3.23,-4.71,;3.23,-1.63,;1.89,-.86,;.56,-1.63,;1.89,.68,;.56,1.45,;-.77,.68,;-2.11,1.45,;-3.44,.68,;-4.78,1.45,;-6.11,.68,;-4.78,2.99,;-3.44,3.76,;-2.11,2.99,;-.77,3.76,;.56,2.99,;1.89,3.76,;1.89,5.3,;.56,6.07,;3.23,6.07,;4.56,5.3,;4.56,3.76,;3.23,2.99,;3.23,1.45,)|
Show InChI InChI=1S/C18H18Cl2N6O/c1-18(2,3)26-17(27)25-15-10(13-11(19)5-4-6-12(13)20)7-9-8-22-16(21)24-14(9)23-15/h4-8H,1-3H3,(H4,21,22,23,24,25,26,27)
Reactome pathway
n/an/a 290n/an/an/an/an/an/a
Health Science Center Xi'an Jiaotong University
Curated by ChEMBL
Assay Description
Inhibition of FGFR3 (unknown origin) after 90 mins by TR-FRET assay
Bioorg Med Chem Lett 25: 1556-60 (2015)
Article DOI: 10.1016/j.bmcl.2015.02.010
BindingDB Entry DOI: 10.7270/Q2NP262J
Fibroblast growth factor receptor 2
(Homo sapiens (Human))
BDBM3428
(1-[2-amino-6-(2,6-dichlorophenyl)pyrido[2,3-d]pyri...)
Show SMILES CC(C)(C)NC(=O)Nc1nc2nc(N)ncc2cc1-c1c(Cl)cccc1Cl |(4.56,-3.94,;3.23,-3.17,;1.89,-3.94,;3.23,-4.71,;3.23,-1.63,;1.89,-.86,;.56,-1.63,;1.89,.68,;.56,1.45,;-.77,.68,;-2.11,1.45,;-3.44,.68,;-4.78,1.45,;-6.11,.68,;-4.78,2.99,;-3.44,3.76,;-2.11,2.99,;-.77,3.76,;.56,2.99,;1.89,3.76,;1.89,5.3,;.56,6.07,;3.23,6.07,;4.56,5.3,;4.56,3.76,;3.23,2.99,;3.23,1.45,)|
Show InChI InChI=1S/C18H18Cl2N6O/c1-18(2,3)26-17(27)25-15-10(13-11(19)5-4-6-12(13)20)7-9-8-22-16(21)24-14(9)23-15/h4-8H,1-3H3,(H4,21,22,23,24,25,26,27)
NCI pathway
Reactome pathway
n/an/a 130n/an/an/an/an/an/a
Health Science Center Xi'an Jiaotong University
Curated by ChEMBL
Assay Description
Inhibition of FGFR2 (unknown origin) after 90 mins by TR-FRET assay
Bioorg Med Chem Lett 25: 1556-60 (2015)
Article DOI: 10.1016/j.bmcl.2015.02.010
BindingDB Entry DOI: 10.7270/Q2NP262J
Fibroblast growth factor receptor 1
(Homo sapiens (Human))
BDBM3428
(1-[2-amino-6-(2,6-dichlorophenyl)pyrido[2,3-d]pyri...)
Show SMILES CC(C)(C)NC(=O)Nc1nc2nc(N)ncc2cc1-c1c(Cl)cccc1Cl |(4.56,-3.94,;3.23,-3.17,;1.89,-3.94,;3.23,-4.71,;3.23,-1.63,;1.89,-.86,;.56,-1.63,;1.89,.68,;.56,1.45,;-.77,.68,;-2.11,1.45,;-3.44,.68,;-4.78,1.45,;-6.11,.68,;-4.78,2.99,;-3.44,3.76,;-2.11,2.99,;-.77,3.76,;.56,2.99,;1.89,3.76,;1.89,5.3,;.56,6.07,;3.23,6.07,;4.56,5.3,;4.56,3.76,;3.23,2.99,;3.23,1.45,)|
Show InChI InChI=1S/C18H18Cl2N6O/c1-18(2,3)26-17(27)25-15-10(13-11(19)5-4-6-12(13)20)7-9-8-22-16(21)24-14(9)23-15/h4-8H,1-3H3,(H4,21,22,23,24,25,26,27)
NCI pathway
Reactome pathway
n/an/a 110n/an/an/an/an/an/a
Health Science Center Xi'an Jiaotong University
Curated by ChEMBL
Assay Description
Inhibition of FGFR1 (unknown origin) after 90 mins by TR-FRET assay
Bioorg Med Chem Lett 25: 1556-60 (2015)
Article DOI: 10.1016/j.bmcl.2015.02.010
BindingDB Entry DOI: 10.7270/Q2NP262J
Epidermal growth factor receptor
(Homo sapiens (Human))
BDBM3428
(1-[2-amino-6-(2,6-dichlorophenyl)pyrido[2,3-d]pyri...)
Show SMILES CC(C)(C)NC(=O)Nc1nc2nc(N)ncc2cc1-c1c(Cl)cccc1Cl |(4.56,-3.94,;3.23,-3.17,;1.89,-3.94,;3.23,-4.71,;3.23,-1.63,;1.89,-.86,;.56,-1.63,;1.89,.68,;.56,1.45,;-.77,.68,;-2.11,1.45,;-3.44,.68,;-4.78,1.45,;-6.11,.68,;-4.78,2.99,;-3.44,3.76,;-2.11,2.99,;-.77,3.76,;.56,2.99,;1.89,3.76,;1.89,5.3,;.56,6.07,;3.23,6.07,;4.56,5.3,;4.56,3.76,;3.23,2.99,;3.23,1.45,)|
Show InChI InChI=1S/C18H18Cl2N6O/c1-18(2,3)26-17(27)25-15-10(13-11(19)5-4-6-12(13)20)7-9-8-22-16(21)24-14(9)23-15/h4-8H,1-3H3,(H4,21,22,23,24,25,26,27)
n/an/a 450n/an/an/an/an/an/a
Parke-Davis Pharmaceutical Research
Assay Description
Inhibition of Epidermal growth factor receptor
Bioorg Med Chem Lett 7: 2415-20 (1997)
Article DOI: 10.1074/jbc.M606873200
BindingDB Entry DOI: 10.7270/Q28C9TF2
Protein kinase C (PKC)
(Homo sapiens (Human))
BDBM3428
(1-[2-amino-6-(2,6-dichlorophenyl)pyrido[2,3-d]pyri...)
Show SMILES CC(C)(C)NC(=O)Nc1nc2nc(N)ncc2cc1-c1c(Cl)cccc1Cl |(4.56,-3.94,;3.23,-3.17,;1.89,-3.94,;3.23,-4.71,;3.23,-1.63,;1.89,-.86,;.56,-1.63,;1.89,.68,;.56,1.45,;-.77,.68,;-2.11,1.45,;-3.44,.68,;-4.78,1.45,;-6.11,.68,;-4.78,2.99,;-3.44,3.76,;-2.11,2.99,;-.77,3.76,;.56,2.99,;1.89,3.76,;1.89,5.3,;.56,6.07,;3.23,6.07,;4.56,5.3,;4.56,3.76,;3.23,2.99,;3.23,1.45,)|
Show InChI InChI=1S/C18H18Cl2N6O/c1-18(2,3)26-17(27)25-15-10(13-11(19)5-4-6-12(13)20)7-9-8-22-16(21)24-14(9)23-15/h4-8H,1-3H3,(H4,21,22,23,24,25,26,27)
n/an/a 5.00E+4n/an/an/an/an/an/a
Parke-Davis Pharmaceutical Research
Assay Description
Inhibitory activity against platelet-derived growth factor receptor
Bioorg Med Chem Lett 7: 2415-20 (1997)
Article DOI: 10.1074/jbc.M606873200
BindingDB Entry DOI: 10.7270/Q28C9TF2
Cyclin-dependent kinase 4
(Homo sapiens (Human))
BDBM3428
(1-[2-amino-6-(2,6-dichlorophenyl)pyrido[2,3-d]pyri...)
Show SMILES CC(C)(C)NC(=O)Nc1nc2nc(N)ncc2cc1-c1c(Cl)cccc1Cl |(4.56,-3.94,;3.23,-3.17,;1.89,-3.94,;3.23,-4.71,;3.23,-1.63,;1.89,-.86,;.56,-1.63,;1.89,.68,;.56,1.45,;-.77,.68,;-2.11,1.45,;-3.44,.68,;-4.78,1.45,;-6.11,.68,;-4.78,2.99,;-3.44,3.76,;-2.11,2.99,;-.77,3.76,;.56,2.99,;1.89,3.76,;1.89,5.3,;.56,6.07,;3.23,6.07,;4.56,5.3,;4.56,3.76,;3.23,2.99,;3.23,1.45,)|
Show InChI InChI=1S/C18H18Cl2N6O/c1-18(2,3)26-17(27)25-15-10(13-11(19)5-4-6-12(13)20)7-9-8-22-16(21)24-14(9)23-15/h4-8H,1-3H3,(H4,21,22,23,24,25,26,27)
NCI pathway
Reactome pathway
n/an/a>5.00E+4n/an/an/an/an/an/a
Parke-Davis Pharmaceutical Research
Assay Description
Inhibition of CDK4
Bioorg Med Chem Lett 7: 2415-20 (1997)
Article DOI: 10.1074/jbc.M606873200
BindingDB Entry DOI: 10.7270/Q28C9TF2
Mitogen-activated protein kinase; ERK1/ERK2
(Homo sapiens (Human))
BDBM3428
(1-[2-amino-6-(2,6-dichlorophenyl)pyrido[2,3-d]pyri...)
Show SMILES CC(C)(C)NC(=O)Nc1nc2nc(N)ncc2cc1-c1c(Cl)cccc1Cl |(4.56,-3.94,;3.23,-3.17,;1.89,-3.94,;3.23,-4.71,;3.23,-1.63,;1.89,-.86,;.56,-1.63,;1.89,.68,;.56,1.45,;-.77,.68,;-2.11,1.45,;-3.44,.68,;-4.78,1.45,;-6.11,.68,;-4.78,2.99,;-3.44,3.76,;-2.11,2.99,;-.77,3.76,;.56,2.99,;1.89,3.76,;1.89,5.3,;.56,6.07,;3.23,6.07,;4.56,5.3,;4.56,3.76,;3.23,2.99,;3.23,1.45,)|
Show InChI InChI=1S/C18H18Cl2N6O/c1-18(2,3)26-17(27)25-15-10(13-11(19)5-4-6-12(13)20)7-9-8-22-16(21)24-14(9)23-15/h4-8H,1-3H3,(H4,21,22,23,24,25,26,27)
NCI pathway
Reactome pathway
n/an/a 7.10E+3n/an/an/an/an/an/a
Parke-Davis Pharmaceutical Research
Assay Description
Inhibitory activity against platelet-derived growth factor receptor
Bioorg Med Chem Lett 7: 2415-20 (1997)
Article DOI: 10.1074/jbc.M606873200
BindingDB Entry DOI: 10.7270/Q28C9TF2
Insulin receptor
(Homo sapiens (Human))
BDBM3428
(1-[2-amino-6-(2,6-dichlorophenyl)pyrido[2,3-d]pyri...)
Show SMILES CC(C)(C)NC(=O)Nc1nc2nc(N)ncc2cc1-c1c(Cl)cccc1Cl |(4.56,-3.94,;3.23,-3.17,;1.89,-3.94,;3.23,-4.71,;3.23,-1.63,;1.89,-.86,;.56,-1.63,;1.89,.68,;.56,1.45,;-.77,.68,;-2.11,1.45,;-3.44,.68,;-4.78,1.45,;-6.11,.68,;-4.78,2.99,;-3.44,3.76,;-2.11,2.99,;-.77,3.76,;.56,2.99,;1.89,3.76,;1.89,5.3,;.56,6.07,;3.23,6.07,;4.56,5.3,;4.56,3.76,;3.23,2.99,;3.23,1.45,)|
Show InChI InChI=1S/C18H18Cl2N6O/c1-18(2,3)26-17(27)25-15-10(13-11(19)5-4-6-12(13)20)7-9-8-22-16(21)24-14(9)23-15/h4-8H,1-3H3,(H4,21,22,23,24,25,26,27)
n/an/a>5.00E+4n/an/an/an/an/an/a
Parke-Davis Pharmaceutical Research
Assay Description
Inhibition of Insulin receptor
Bioorg Med Chem Lett 7: 2415-20 (1997)
Article DOI: 10.1074/jbc.M606873200
BindingDB Entry DOI: 10.7270/Q28C9TF2
Fibroblast growth factor receptor 1
(Homo sapiens (Human))
BDBM3428
(1-[2-amino-6-(2,6-dichlorophenyl)pyrido[2,3-d]pyri...)
Show SMILES CC(C)(C)NC(=O)Nc1nc2nc(N)ncc2cc1-c1c(Cl)cccc1Cl |(4.56,-3.94,;3.23,-3.17,;1.89,-3.94,;3.23,-4.71,;3.23,-1.63,;1.89,-.86,;.56,-1.63,;1.89,.68,;.56,1.45,;-.77,.68,;-2.11,1.45,;-3.44,.68,;-4.78,1.45,;-6.11,.68,;-4.78,2.99,;-3.44,3.76,;-2.11,2.99,;-.77,3.76,;.56,2.99,;1.89,3.76,;1.89,5.3,;.56,6.07,;3.23,6.07,;4.56,5.3,;4.56,3.76,;3.23,2.99,;3.23,1.45,)|
Show InChI InChI=1S/C18H18Cl2N6O/c1-18(2,3)26-17(27)25-15-10(13-11(19)5-4-6-12(13)20)7-9-8-22-16(21)24-14(9)23-15/h4-8H,1-3H3,(H4,21,22,23,24,25,26,27)
NCI pathway
Reactome pathway
n/an/a 140n/an/an/an/a7.425
Pfizer
Assay Description
IC50 is the inhibitor concentration which inhibits 50% of kinase activity that catalyzes the transfer of the terminal phosphate from [gamma-32P] labe...
J Med Chem 44: 1915-26 (2001)
Article DOI: 10.1021/jm0004291
BindingDB Entry DOI: 10.7270/Q29K48DG