BDBM3437 1-[2-Amino-6-(2,6-dibromo-phenyl)-pyrido-[2,3-d]pyrimidin-7-yl]-3-tert-butyl-urea::1-[2-amino-6-(2,6-dibromophenyl)pyrido[2,3-d]pyrimidin-7-yl]-3-tert-butylurea::6-arylpyrido[2,3-d]pyrimidine deriv. 19::PD089828 analog 8
SMILES: CC(C)(C)NC(=O)Nc1nc2nc(N)ncc2cc1-c1c(Br)cccc1Br
InChI Key: InChIKey=BLWHUHULXVDXMZ-UHFFFAOYSA-N
Data: 7 IC50
Activity Spreadsheet -- Enzyme Inhibition Constant Data from BindingDB
Found 7 hits for monomerid = 3437
Trg + Lig
Ki
nM
ΔG°
kcal/mole
IC50
nM
Kd
nM
EC50/IC50
nM
koff
s-1
kon
M-1s-1
pHTemp
°C
Platelet-derived growth factor receptor beta
(Homo sapiens (Human))
BDBM3437
(1-[2-Amino-6-(2,6-dibromo-phenyl)-pyrido-[2,3-d]py...)
Show SMILES CC(C)(C)NC(=O)Nc1nc2nc(N)ncc2cc1-c1c(Br)cccc1Br |(5.49,-4.29,;4.16,-3.52,;2.83,-4.29,;4.16,-5.06,;4.16,-1.98,;2.83,-1.21,;1.49,-1.98,;2.83,.33,;1.49,1.1,;.16,.33,;-1.17,1.1,;-2.51,.33,;-3.84,1.1,;-5.18,.33,;-3.84,2.64,;-2.51,3.41,;-1.17,2.64,;.16,3.41,;1.49,2.64,;2.83,3.41,;2.83,4.95,;1.49,5.72,;4.16,5.72,;5.49,4.95,;5.49,3.41,;4.16,2.64,;4.16,1.1,)|
Show InChI InChI=1S/C18H18Br2N6O/c1-18(2,3)26-17(27)25-15-10(13-11(19)5-4-6-12(13)20)7-9-8-22-16(21)24-14(9)23-15/h4-8H,1-3H3,(H4,21,22,23,24,25,26,27)
NCI pathway
Reactome pathway
n/an/a 1.40E+3n/an/an/an/an/an/a
Pfizer
Assay Description
IC50 is the inhibitor concentration which inhibits 50% of kinase activity that catalyzes the transfer of the terminal phosphate from [gamma-32P] labe...
J Med Chem 44: 1915-26 (2001)
Article DOI: 10.1021/jm0004291
BindingDB Entry DOI: 10.7270/Q29K48DG
Fibroblast growth factor receptor 1
(Homo sapiens (Human))
BDBM3437
(1-[2-Amino-6-(2,6-dibromo-phenyl)-pyrido-[2,3-d]py...)
Show SMILES CC(C)(C)NC(=O)Nc1nc2nc(N)ncc2cc1-c1c(Br)cccc1Br |(5.49,-4.29,;4.16,-3.52,;2.83,-4.29,;4.16,-5.06,;4.16,-1.98,;2.83,-1.21,;1.49,-1.98,;2.83,.33,;1.49,1.1,;.16,.33,;-1.17,1.1,;-2.51,.33,;-3.84,1.1,;-5.18,.33,;-3.84,2.64,;-2.51,3.41,;-1.17,2.64,;.16,3.41,;1.49,2.64,;2.83,3.41,;2.83,4.95,;1.49,5.72,;4.16,5.72,;5.49,4.95,;5.49,3.41,;4.16,2.64,;4.16,1.1,)|
Show InChI InChI=1S/C18H18Br2N6O/c1-18(2,3)26-17(27)25-15-10(13-11(19)5-4-6-12(13)20)7-9-8-22-16(21)24-14(9)23-15/h4-8H,1-3H3,(H4,21,22,23,24,25,26,27)
NCI pathway
Reactome pathway
n/an/a 290n/an/an/an/an/an/a
Pfizer
Assay Description
IC50 is the inhibitor concentration which inhibits 50% of kinase activity that catalyzes the transfer of the terminal phosphate from [gamma-32P] labe...
J Med Chem 44: 1915-26 (2001)
Article DOI: 10.1021/jm0004291
BindingDB Entry DOI: 10.7270/Q29K48DG
Proto-oncogene tyrosine-protein kinase Src
(Homo sapiens (Human))
BDBM3437
(1-[2-Amino-6-(2,6-dibromo-phenyl)-pyrido-[2,3-d]py...)
Show SMILES CC(C)(C)NC(=O)Nc1nc2nc(N)ncc2cc1-c1c(Br)cccc1Br |(5.49,-4.29,;4.16,-3.52,;2.83,-4.29,;4.16,-5.06,;4.16,-1.98,;2.83,-1.21,;1.49,-1.98,;2.83,.33,;1.49,1.1,;.16,.33,;-1.17,1.1,;-2.51,.33,;-3.84,1.1,;-5.18,.33,;-3.84,2.64,;-2.51,3.41,;-1.17,2.64,;.16,3.41,;1.49,2.64,;2.83,3.41,;2.83,4.95,;1.49,5.72,;4.16,5.72,;5.49,4.95,;5.49,3.41,;4.16,2.64,;4.16,1.1,)|
Show InChI InChI=1S/C18H18Br2N6O/c1-18(2,3)26-17(27)25-15-10(13-11(19)5-4-6-12(13)20)7-9-8-22-16(21)24-14(9)23-15/h4-8H,1-3H3,(H4,21,22,23,24,25,26,27)
n/an/a 210n/an/an/an/an/an/a
Pfizer
Assay Description
IC50 is the inhibitor concentration which inhibits 50% of kinase activity that catalyzes the transfer of the terminal phosphate from [gamma-32P] labe...
J Med Chem 44: 1915-26 (2001)
Article DOI: 10.1021/jm0004291
BindingDB Entry DOI: 10.7270/Q29K48DG
PDGFR-beta/Platelet-derived growth factor receptor alpha
(Homo sapiens (Human))
BDBM3437
(1-[2-Amino-6-(2,6-dibromo-phenyl)-pyrido-[2,3-d]py...)
Show SMILES CC(C)(C)NC(=O)Nc1nc2nc(N)ncc2cc1-c1c(Br)cccc1Br |(5.49,-4.29,;4.16,-3.52,;2.83,-4.29,;4.16,-5.06,;4.16,-1.98,;2.83,-1.21,;1.49,-1.98,;2.83,.33,;1.49,1.1,;.16,.33,;-1.17,1.1,;-2.51,.33,;-3.84,1.1,;-5.18,.33,;-3.84,2.64,;-2.51,3.41,;-1.17,2.64,;.16,3.41,;1.49,2.64,;2.83,3.41,;2.83,4.95,;1.49,5.72,;4.16,5.72,;5.49,4.95,;5.49,3.41,;4.16,2.64,;4.16,1.1,)|
Show InChI InChI=1S/C18H18Br2N6O/c1-18(2,3)26-17(27)25-15-10(13-11(19)5-4-6-12(13)20)7-9-8-22-16(21)24-14(9)23-15/h4-8H,1-3H3,(H4,21,22,23,24,25,26,27)
Reactome pathway
n/an/a 1.42E+3n/an/an/an/an/an/a
Parke-Davis Pharmaceutical Research
Assay Description
Inhibitory activity against platelet-derived growth factor receptor
Bioorg Med Chem Lett 7: 2415-20 (1997)
Article DOI: 10.1074/jbc.M606873200
BindingDB Entry DOI: 10.7270/Q28C9TF2
Fibroblast growth factor receptor 1
(Homo sapiens (Human))
BDBM3437
(1-[2-Amino-6-(2,6-dibromo-phenyl)-pyrido-[2,3-d]py...)
Show SMILES CC(C)(C)NC(=O)Nc1nc2nc(N)ncc2cc1-c1c(Br)cccc1Br |(5.49,-4.29,;4.16,-3.52,;2.83,-4.29,;4.16,-5.06,;4.16,-1.98,;2.83,-1.21,;1.49,-1.98,;2.83,.33,;1.49,1.1,;.16,.33,;-1.17,1.1,;-2.51,.33,;-3.84,1.1,;-5.18,.33,;-3.84,2.64,;-2.51,3.41,;-1.17,2.64,;.16,3.41,;1.49,2.64,;2.83,3.41,;2.83,4.95,;1.49,5.72,;4.16,5.72,;5.49,4.95,;5.49,3.41,;4.16,2.64,;4.16,1.1,)|
Show InChI InChI=1S/C18H18Br2N6O/c1-18(2,3)26-17(27)25-15-10(13-11(19)5-4-6-12(13)20)7-9-8-22-16(21)24-14(9)23-15/h4-8H,1-3H3,(H4,21,22,23,24,25,26,27)
NCI pathway
Reactome pathway
n/an/a 290n/an/an/an/an/an/a
Parke-Davis Pharmaceutical Research
Assay Description
The kinase activity is the enzyme activity that catalyzes the transfer of the terminal phosphate from [gamma-32P] ATP to the poly (E: Y) substrate. N...
Bioorg Med Chem Lett 7: 2415-20 (1997)
Article DOI: 10.1074/jbc.M606873200
BindingDB Entry DOI: 10.7270/Q28C9TF2
Proto-oncogene tyrosine-protein kinase Src
(Homo sapiens (Human))
BDBM3437
(1-[2-Amino-6-(2,6-dibromo-phenyl)-pyrido-[2,3-d]py...)
Show SMILES CC(C)(C)NC(=O)Nc1nc2nc(N)ncc2cc1-c1c(Br)cccc1Br |(5.49,-4.29,;4.16,-3.52,;2.83,-4.29,;4.16,-5.06,;4.16,-1.98,;2.83,-1.21,;1.49,-1.98,;2.83,.33,;1.49,1.1,;.16,.33,;-1.17,1.1,;-2.51,.33,;-3.84,1.1,;-5.18,.33,;-3.84,2.64,;-2.51,3.41,;-1.17,2.64,;.16,3.41,;1.49,2.64,;2.83,3.41,;2.83,4.95,;1.49,5.72,;4.16,5.72,;5.49,4.95,;5.49,3.41,;4.16,2.64,;4.16,1.1,)|
Show InChI InChI=1S/C18H18Br2N6O/c1-18(2,3)26-17(27)25-15-10(13-11(19)5-4-6-12(13)20)7-9-8-22-16(21)24-14(9)23-15/h4-8H,1-3H3,(H4,21,22,23,24,25,26,27)
n/an/a 210n/an/an/an/an/an/a
Parke-Davis Pharmaceutical Research
Assay Description
The kinase activity is the enzyme activity that catalyzes the transfer of the terminal phosphate from [gamma-32P] labeled ATP to the poly (E: Y) subs...
Bioorg Med Chem Lett 7: 2415-20 (1997)
Article DOI: 10.1074/jbc.M606873200
BindingDB Entry DOI: 10.7270/Q28C9TF2
Platelet-derived growth factor receptor beta
(Homo sapiens (Human))
BDBM3437
(1-[2-Amino-6-(2,6-dibromo-phenyl)-pyrido-[2,3-d]py...)
Show SMILES CC(C)(C)NC(=O)Nc1nc2nc(N)ncc2cc1-c1c(Br)cccc1Br |(5.49,-4.29,;4.16,-3.52,;2.83,-4.29,;4.16,-5.06,;4.16,-1.98,;2.83,-1.21,;1.49,-1.98,;2.83,.33,;1.49,1.1,;.16,.33,;-1.17,1.1,;-2.51,.33,;-3.84,1.1,;-5.18,.33,;-3.84,2.64,;-2.51,3.41,;-1.17,2.64,;.16,3.41,;1.49,2.64,;2.83,3.41,;2.83,4.95,;1.49,5.72,;4.16,5.72,;5.49,4.95,;5.49,3.41,;4.16,2.64,;4.16,1.1,)|
Show InChI InChI=1S/C18H18Br2N6O/c1-18(2,3)26-17(27)25-15-10(13-11(19)5-4-6-12(13)20)7-9-8-22-16(21)24-14(9)23-15/h4-8H,1-3H3,(H4,21,22,23,24,25,26,27)
NCI pathway
Reactome pathway
n/an/a 1.42E+3n/an/an/an/a7.425
Parke-Davis Pharmaceutical Research
Assay Description
The kinase activity is the enzyme activity that catalyzes the transfer of the terminal phosphate from [gamma-32P] ATP to the poly (E: Y) substrate. N...
Bioorg Med Chem Lett 7: 2415-20 (1997)
Article DOI: 10.1074/jbc.M606873200
BindingDB Entry DOI: 10.7270/Q28C9TF2