BDBM343811 1-(3-(1-benzyl-1H-benzo[d]imidazol-6-yl)phenoxy)-3-(3,4-dihydroisoquinolin-2(1H)-yl)propan-2-ol::US9777008, Compound 105
SMILES: OC(COc1cccc(c1)-c1ccc2ncn(Cc3ccccc3)c2c1)CN1CCc2ccccc2C1
InChI Key: InChIKey=QRPLRPXUJNDKKA-UHFFFAOYSA-N
Data: 1 IC50
Activity Spreadsheet -- Enzyme Inhibition Constant Data from BindingDB
Found 1 hit for monomerid = 343811
Trg + Lig
Ki
nM
ΔG°
kcal/mole
IC50
nM
Kd
nM
EC50/IC50
nM
koff
s-1
kon
M-1s-1
pHTemp
°C
PRMT5/MEP50 Enzyme
(Homo sapiens (Human))
BDBM343811
(1-(3-(1-benzyl-1H-benzo[d]imidazol-6-yl)phenoxy)-3...)
Show SMILES OC(COc1cccc(c1)-c1ccc2ncn(Cc3ccccc3)c2c1)CN1CCc2ccccc2C1
Show InChI InChI=1S/C32H31N3O2/c36-29(21-34-16-15-25-9-4-5-10-28(25)20-34)22-37-30-12-6-11-26(17-30)27-13-14-31-32(18-27)35(23-33-31)19-24-7-2-1-3-8-24/h1-14,17-18,23,29,36H,15-16,19-22H2
US Patent
n/an/a<100n/an/an/an/an/an/a
Epizyme, Inc.
US Patent
Assay Description
The assays were all performed in a buffer consisting of 20 mM Bicine (pH=7.6), 1 mM TCEP, 0.005% BSG, and 0.002% Tween20, prepared on the day of use....
US Patent US9777008 (2017)
BindingDB Entry DOI: 10.7270/Q26975QQ