BDBM343975 US9777008, Compound 269
SMILES: OC(COc1cccc(c1)-c1ccc2ncn(C3COC3)c2c1)CN1CCc2ccccc2C1
InChI Key: InChIKey=WRDVWZZVGHSXQB-UHFFFAOYSA-N
Data: 1 IC50
Activity Spreadsheet -- Enzyme Inhibition Constant Data from BindingDB
Found 1 hit for monomerid = 343975
Trg + Lig
Ki
nM
ΔG°
kcal/mole
IC50
nM
Kd
nM
EC50/IC50
nM
koff
s-1
kon
M-1s-1
pHTemp
°C
PRMT5/MEP50 Enzyme
(Homo sapiens (Human))
BDBM343975
(US9777008, Compound 269)
Show SMILES OC(COc1cccc(c1)-c1ccc2ncn(C3COC3)c2c1)CN1CCc2ccccc2C1
Show InChI InChI=1S/C28H29N3O3/c32-25(15-30-11-10-20-4-1-2-5-23(20)14-30)18-34-26-7-3-6-21(12-26)22-8-9-27-28(13-22)31(19-29-27)24-16-33-17-24/h1-9,12-13,19,24-25,32H,10-11,14-18H2
US Patent
n/an/a<100n/an/an/an/an/an/a
Epizyme, Inc.
US Patent
Assay Description
The assays were all performed in a buffer consisting of 20 mM Bicine (pH=7.6), 1 mM TCEP, 0.005% BSG, and 0.002% Tween20, prepared on the day of use....
US Patent US9777008 (2017)
BindingDB Entry DOI: 10.7270/Q26975QQ