null
SMILES: CC(C)Oc1nc(ccc1NC(=O)c1coc2CC(C)(C)NC(=O)c12)N1CCN(C[C@H]1CO)C(C)=O
InChI Key: InChIKey=WNTJSUYENUORNM-INIZCTEOSA-N
Activity Spreadsheet -- Enzyme Inhibition Constant Data from BindingDB
Found 1 hit for monomerid = 344240
Trg + Lig
Ki
nM
ΔG°
kcal/mole
IC50
nM
Kd
nM
EC50/IC50
nM
koff
s-1
kon
M-1s-1
pHTemp
°C
High affinity nerve growth factor receptor
(Homo sapiens (Human))
BDBM344240
(N-{6-[(2S)-4-acetyl-2-(hydroxymethyl)piperazin-1-y...)
Show SMILES CC(C)Oc1nc(ccc1NC(=O)c1coc2CC(C)(C)NC(=O)c12)N1CCN(C[C@H]1CO)C(C)=O
Show InChI InChI=1S/C25H33N5O6/c1-14(2)36-24-18(6-7-20(27-24)30-9-8-29(15(3)32)11-16(30)12-31)26-22(33)17-13-35-19-10-25(4,5)28-23(34)21(17)19/h6-7,13-14,16,31H,8-12H2,1-5H3,(H,26,33)(H,28,34)/t16-/m0/s1
US Patent
n/an/a 3.90n/an/an/an/an/an/a
AbbVie Inc.
US Patent
US Patent US9777020 (2017)
BindingDB Entry DOI: 10.7270/Q2T155R7