null
SMILES: CCOc1nc(ccc1NC(=O)c1coc2CC(C)(C)N(CCOCCO)C(=O)c12)N1CCN(CC1)C(C)=O
InChI Key: InChIKey=RSJBSBOAUWEEPV-UHFFFAOYSA-N
Activity Spreadsheet -- Enzyme Inhibition Constant Data from BindingDB
Found 1 hit for monomerid = 344282
Trg + Lig
Ki
nM
ΔG°
kcal/mole
IC50
nM
Kd
nM
EC50/IC50
nM
koff
s-1
kon
M-1s-1
pHTemp
°C
High affinity nerve growth factor receptor
(Homo sapiens (Human))
BDBM344282
(N-[6-(4-acetylpiperazin-1-yl)-2-ethoxypyridin-3-yl...)
Show SMILES CCOc1nc(ccc1NC(=O)c1coc2CC(C)(C)N(CCOCCO)C(=O)c12)N1CCN(CC1)C(C)=O
Show InChI InChI=1S/C27H37N5O7/c1-5-38-25-20(6-7-22(29-25)31-10-8-30(9-11-31)18(2)34)28-24(35)19-17-39-21-16-27(3,4)32(26(36)23(19)21)12-14-37-15-13-33/h6-7,17,33H,5,8-16H2,1-4H3,(H,28,35)
US Patent
n/an/a 2.10n/an/an/an/an/an/a
AbbVie Inc.
US Patent
US Patent US9777020 (2017)
BindingDB Entry DOI: 10.7270/Q2T155R7