BDBM345059 4-({(2R)-2-[5-(3-chloro- 2,6-difluorophenyl)-1- oxidopyridin-2-yl]-3- phenylpropanoyl}amino) benzoic acid::US9783530, 4
SMILES: OC(=O)c1ccc(NC(=O)[C@H](Cc2ccccc2)c2ccc(c[n+]2[O-])-c2c(F)ccc(Cl)c2F)cc1
InChI Key: InChIKey=XKFNAKACSRLZKU-HXUWFJFHSA-N
Data: 2 IC50
Activity Spreadsheet -- Enzyme Inhibition Constant Data from BindingDB
Found 2 hits for monomerid = 345059
Trg + Lig
Ki
nM
ΔG°
kcal/mole
IC50
nM
Kd
nM
EC50/IC50
nM
koff
s-1
kon
M-1s-1
pHTemp
°C
Kallikrein 1
(Homo sapiens (Human))
BDBM345059
(4-({(2R)-2-[5-(3-chloro- 2,6-difluorophenyl)-1- ox...)
Show SMILES OC(=O)c1ccc(NC(=O)[C@H](Cc2ccccc2)c2ccc(c[n+]2[O-])-c2c(F)ccc(Cl)c2F)cc1 |r|
Show InChI InChI=1S/C27H19ClF2N2O4/c28-21-11-12-22(29)24(25(21)30)18-8-13-23(32(36)15-18)20(14-16-4-2-1-3-5-16)26(33)31-19-9-6-17(7-10-19)27(34)35/h1-13,15,20H,14H2,(H,31,33)(H,34,35)/t20-/m1/s1
US Patent
n/an/a 18.2n/an/an/an/an/an/a
Merck Sharp & Dohme Corp.
US Patent
Assay Description
Kallikrein determinations were made in 50 mM HEPES buffer at pH 7.4 containing 150 mM NaCl, 5 mM CaCl2, and 0.1% PEG 8000 (polyethylene glycol; Fishe...
US Patent US9783530 (2017)
BindingDB Entry DOI: 10.7270/Q2N87CXK
Coagulation factor XI
(Homo sapiens (Human))
BDBM345059
(4-({(2R)-2-[5-(3-chloro- 2,6-difluorophenyl)-1- ox...)
Show SMILES OC(=O)c1ccc(NC(=O)[C@H](Cc2ccccc2)c2ccc(c[n+]2[O-])-c2c(F)ccc(Cl)c2F)cc1 |r|
Show InChI InChI=1S/C27H19ClF2N2O4/c28-21-11-12-22(29)24(25(21)30)18-8-13-23(32(36)15-18)20(14-16-4-2-1-3-5-16)26(33)31-19-9-6-17(7-10-19)27(34)35/h1-13,15,20H,14H2,(H,31,33)(H,34,35)/t20-/m1/s1
Reactome pathway
US Patent
n/an/a 3.63n/an/an/an/an/an/a
Merck Sharp & Dohme Corp.
US Patent
Assay Description
Factor XIa determinations were made in 50 mM HEPES buffer at pH 7.4 containing 150 mM NaCl, 5 mM CaCl2, and 0.1% PEG 8000 (polyethylene glycol; JT Ba...
US Patent US9783530 (2017)
BindingDB Entry DOI: 10.7270/Q2N87CXK