null
SMILES: COc1cccc(c1)-c1cc(COC(C)(C)C(O)=O)nn1Cc1ccccc1Br
InChI Key: InChIKey=LUHYWMZESCMRFH-UHFFFAOYSA-N
Activity Spreadsheet -- Enzyme Inhibition Constant Data from BindingDB
Found 6 hits for monomerid = 345284
Trg + Lig
Ki
nM
ΔG°
kcal/mole
IC50
nM
Kd
nM
EC50/IC50
nM
koff
s-1
kon
M-1s-1
pHTemp
°C
Monocarboxylate transporter 4
(Homo sapiens (Human))
BDBM345284
(2-[[1-[(2-Bromophenyl)methyl]-5-(3- methoxyphenyl...)
Show SMILES COc1cccc(c1)-c1cc(COC(C)(C)C(O)=O)nn1Cc1ccccc1Br
Show InChI InChI=1S/C22H23BrN2O4/c1-22(2,21(26)27)29-14-17-12-20(15-8-6-9-18(11-15)28-3)25(24-17)13-16-7-4-5-10-19(16)23/h4-12H,13-14H2,1-3H3,(H,26,27)
Reactome pathway
US Patent
n/an/a 8.80n/an/an/an/an/an/a
Vettore, LLC
US Patent
Assay Description
MDA-MB-231 breast cancer cells may be used to measure MCT4 activity in cells with high native levels of MCT4 and low levels of MCT1 and are known to ...
US Patent US10202350 (2019)
BindingDB Entry DOI: 10.7270/Q20K2BPB
Malignant T-cell-amplified sequence 1
(Homo sapiens (human))
BDBM345284
(2-[[1-[(2-Bromophenyl)methyl]-5-(3- methoxyphenyl...)
Show SMILES COc1cccc(c1)-c1cc(COC(C)(C)C(O)=O)nn1Cc1ccccc1Br
Show InChI InChI=1S/C22H23BrN2O4/c1-22(2,21(26)27)29-14-17-12-20(15-8-6-9-18(11-15)28-3)25(24-17)13-16-7-4-5-10-19(16)23/h4-12H,13-14H2,1-3H3,(H,26,27)
US Patent
n/an/a 2.70E+4n/an/an/an/an/an/a
Vettore, LLC
US Patent
Assay Description
MCT1 activity may be measured using BT-20 breast cancer cells that express high native levels of MCT1, but do not express MCT4 and are known to those...
US Patent US10202350 (2019)
BindingDB Entry DOI: 10.7270/Q20K2BPB
Monocarboxylate transporter 1
(Homo sapiens (Human))
BDBM345284
(2-[[1-[(2-Bromophenyl)methyl]-5-(3- methoxyphenyl...)
Show SMILES COc1cccc(c1)-c1cc(COC(C)(C)C(O)=O)nn1Cc1ccccc1Br
Show InChI InChI=1S/C22H23BrN2O4/c1-22(2,21(26)27)29-14-17-12-20(15-8-6-9-18(11-15)28-3)25(24-17)13-16-7-4-5-10-19(16)23/h4-12H,13-14H2,1-3H3,(H,26,27)
Reactome pathway
n/an/a 2.70E+4n/an/an/an/an/an/a
TBA
Citation and Details
Monocarboxylate transporter 1
(Homo sapiens (Human))
BDBM345284
(2-[[1-[(2-Bromophenyl)methyl]-5-(3- methoxyphenyl...)
Show SMILES COc1cccc(c1)-c1cc(COC(C)(C)C(O)=O)nn1Cc1ccccc1Br
Show InChI InChI=1S/C22H23BrN2O4/c1-22(2,21(26)27)29-14-17-12-20(15-8-6-9-18(11-15)28-3)25(24-17)13-16-7-4-5-10-19(16)23/h4-12H,13-14H2,1-3H3,(H,26,27)
Reactome pathway
US Patent
n/an/a 2.70E+4n/an/an/an/an/an/a
Vettore, LLC
US Patent
Assay Description
MCT1 activity may be measured using BT-20 breast cancer cells that express high native levels of MCT1, but do not express MCT4 and are known to those...
US Patent US10214492 (2019)
BindingDB Entry DOI: 10.7270/Q2Q81GC0
Monocarboxylate transporter 4
(Homo sapiens (Human))
BDBM345284
(2-[[1-[(2-Bromophenyl)methyl]-5-(3- methoxyphenyl...)
Show SMILES COc1cccc(c1)-c1cc(COC(C)(C)C(O)=O)nn1Cc1ccccc1Br
Show InChI InChI=1S/C22H23BrN2O4/c1-22(2,21(26)27)29-14-17-12-20(15-8-6-9-18(11-15)28-3)25(24-17)13-16-7-4-5-10-19(16)23/h4-12H,13-14H2,1-3H3,(H,26,27)
Reactome pathway
n/an/a 8.80n/an/an/an/an/an/a
TBA
Citation and Details
Monocarboxylate transporter 4
(Homo sapiens (Human))
BDBM345284
(2-[[1-[(2-Bromophenyl)methyl]-5-(3- methoxyphenyl...)
Show SMILES COc1cccc(c1)-c1cc(COC(C)(C)C(O)=O)nn1Cc1ccccc1Br
Show InChI InChI=1S/C22H23BrN2O4/c1-22(2,21(26)27)29-14-17-12-20(15-8-6-9-18(11-15)28-3)25(24-17)13-16-7-4-5-10-19(16)23/h4-12H,13-14H2,1-3H3,(H,26,27)
Reactome pathway
US Patent
n/an/a 8.80n/an/an/an/an/an/a
Vettore, LLC
US Patent
Assay Description
MDA-MB-231 breast cancer cells may be used to measure MCT4 activity in cells with high native levels of MCT4 and low levels of MCT1 and are known to ...
US Patent US10214492 (2019)
BindingDB Entry DOI: 10.7270/Q2Q81GC0