BDBM345308 2-({1-[(o-Chlorophenyl)methyl]-5-(m- methoxyphenyl)-4-methyl-1H-pyrazol-3- yl}methoxy)-2-methylpropionic acid 1H-NMR: (300 MHz, MeOD) $#948; 1.53 (6 H, s), 2.09 (3 H, s), 3.67 (3 H, s), 4.60 (2 H, s), 5.31 (2 H, s), 6.67-6.86 (3 H, m), 6.97 (1 H, ddd), 7.17-7.40 (4 H, m).::US10202350, Example 54::US10214492, Example 54
SMILES: COc1cccc(c1)-c1c(C)c(COC(C)(C)C(O)=O)nn1Cc1ccccc1Cl
InChI Key: InChIKey=OKPPJNRDLNLAOL-UHFFFAOYSA-N
Data: 4 IC50
Activity Spreadsheet -- Enzyme Inhibition Constant Data from BindingDB
Found 4 hits for monomerid = 345308
Trg + Lig
Ki
nM
ΔG°
kcal/mole
IC50
nM
Kd
nM
EC50/IC50
nM
koff
s-1
kon
M-1s-1
pHTemp
°C
Monocarboxylate transporter 4
(Homo sapiens (Human))
BDBM345308
(2-({1-[(o-Chlorophenyl)methyl]-5-(m- methoxypheny...)
Show SMILES COc1cccc(c1)-c1c(C)c(COC(C)(C)C(O)=O)nn1Cc1ccccc1Cl
Show InChI InChI=1S/C23H25ClN2O4/c1-15-20(14-30-23(2,3)22(27)28)25-26(13-17-8-5-6-11-19(17)24)21(15)16-9-7-10-18(12-16)29-4/h5-12H,13-14H2,1-4H3,(H,27,28)
Reactome pathway
US Patent
n/an/a 37n/an/an/an/an/an/a
Vettore, LLC
US Patent
Assay Description
MDA-MB-231 breast cancer cells may be used to measure MCT4 activity in cells with high native levels of MCT4 and low levels of MCT1 and are known to ...
US Patent US10202350 (2019)
BindingDB Entry DOI: 10.7270/Q20K2BPB
Monocarboxylate transporter 1
(Homo sapiens (Human))
BDBM345308
(2-({1-[(o-Chlorophenyl)methyl]-5-(m- methoxypheny...)
Show SMILES COc1cccc(c1)-c1c(C)c(COC(C)(C)C(O)=O)nn1Cc1ccccc1Cl
Show InChI InChI=1S/C23H25ClN2O4/c1-15-20(14-30-23(2,3)22(27)28)25-26(13-17-8-5-6-11-19(17)24)21(15)16-9-7-10-18(12-16)29-4/h5-12H,13-14H2,1-4H3,(H,27,28)
Reactome pathway
US Patent
n/an/a 2.70E+4n/an/an/an/an/an/a
Vettore, LLC
US Patent
Assay Description
MCT1 activity may be measured using BT-20 breast cancer cells that express high native levels of MCT1, but do not express MCT4 and are known to those...
US Patent US10214492 (2019)
BindingDB Entry DOI: 10.7270/Q2Q81GC0
Monocarboxylate transporter 4
(Homo sapiens (Human))
BDBM345308
(2-({1-[(o-Chlorophenyl)methyl]-5-(m- methoxypheny...)
Show SMILES COc1cccc(c1)-c1c(C)c(COC(C)(C)C(O)=O)nn1Cc1ccccc1Cl
Show InChI InChI=1S/C23H25ClN2O4/c1-15-20(14-30-23(2,3)22(27)28)25-26(13-17-8-5-6-11-19(17)24)21(15)16-9-7-10-18(12-16)29-4/h5-12H,13-14H2,1-4H3,(H,27,28)
Reactome pathway
US Patent
n/an/a 37n/an/an/an/an/an/a
Vettore, LLC
US Patent
Assay Description
MDA-MB-231 breast cancer cells may be used to measure MCT4 activity in cells with high native levels of MCT4 and low levels of MCT1 and are known to ...
US Patent US10214492 (2019)
BindingDB Entry DOI: 10.7270/Q2Q81GC0
Malignant T-cell-amplified sequence 1
(Homo sapiens (human))
BDBM345308
(2-({1-[(o-Chlorophenyl)methyl]-5-(m- methoxypheny...)
Show SMILES COc1cccc(c1)-c1c(C)c(COC(C)(C)C(O)=O)nn1Cc1ccccc1Cl
Show InChI InChI=1S/C23H25ClN2O4/c1-15-20(14-30-23(2,3)22(27)28)25-26(13-17-8-5-6-11-19(17)24)21(15)16-9-7-10-18(12-16)29-4/h5-12H,13-14H2,1-4H3,(H,27,28)
US Patent
n/an/a 2.70E+4n/an/an/an/an/an/a
Vettore, LLC
US Patent
Assay Description
MCT1 activity may be measured using BT-20 breast cancer cells that express high native levels of MCT1, but do not express MCT4 and are known to those...
US Patent US10202350 (2019)
BindingDB Entry DOI: 10.7270/Q20K2BPB