null
SMILES: Fc1ccccc1-c1ccc(cc1)S(=O)(=O)N1CCN=C1N1CCN(CC1)C1CCC1
InChI Key: InChIKey=JTVOGGBANSFAFA-UHFFFAOYSA-N
Activity Spreadsheet -- Enzyme Inhibition Constant Data from BindingDB
Found 1 hit for monomerid = 345360
Trg + Lig
Ki
nM
ΔG°
kcal/mole
IC50
nM
Kd
nM
EC50/IC50
nM
koff
s-1
kon
M-1s-1
pHTemp
°C
Lysine-specific demethylase 2B
(Homo sapiens (Human))
BDBM345360
(1-cyclobutyl-4-[1-[4-(2-fluorophenyl)phe-nyl]sulfo...)
Show SMILES Fc1ccccc1-c1ccc(cc1)S(=O)(=O)N1CCN=C1N1CCN(CC1)C1CCC1 |c:21|
Show InChI InChI=1S/C23H27FN4O2S/c24-22-7-2-1-6-21(22)18-8-10-20(11-9-18)31(29,30)28-13-12-25-23(28)27-16-14-26(15-17-27)19-4-3-5-19/h1-2,6-11,19H,3-5,12-17H2
US Patent
n/an/a 0.0460n/an/an/an/an/an/a
GENENTECH, INC.; CONSTELLATION PHARMACEUTICALS, INC.
US Patent
Assay Description
Full length KDM2B was cloned, expressed, and purified to homogeneity. Compound inhibition of KDM2B demethylase activity was assessed by monitoring th...
US Patent US10202354 (2019)
BindingDB Entry DOI: 10.7270/Q2VT1V62