BDBM34537 US8546434, 11
SMILES: COC(C)(C)[C@@H](N(CC[C@H](N)CF)C(=O)[C@@H]1CCCO1)c1nc(nn1Cc1ccccc1)-c1cc(F)ccc1F
InChI Key: InChIKey=FIMLBRNZJKDEJN-UHFFFAOYSA-N
Data: 1 IC50
Activity Spreadsheet -- Enzyme Inhibition Constant Data from BindingDB
Found 1 hit for monomerid = 34537
Trg + Lig
Ki
nM
ΔG°
kcal/mole
IC50
nM
Kd
nM
EC50/IC50
nM
koff
s-1
kon
M-1s-1
pHTemp
°C
kinesin spindle protein
(Homo sapiens (Human))
BDBM34537
(US8546434, 11)
Show SMILES COC(C)(C)[C@@H](N(CC[C@H](N)CF)C(=O)[C@@H]1CCCO1)c1nc(nn1Cc1ccccc1)-c1cc(F)ccc1F |r|
Show InChI InChI=1S/C21H27N5O2S/c1-15-6-8-16(9-7-15)14-26-17-18(24(2)20(28)23-19(17)27)22-21(26)29-13-12-25-10-4-3-5-11-25/h6-9H,3-5,10-14H2,1-2H3,(H,23,27,28)
Reactome pathway
US Patent
n/an/a 1.40n/an/an/an/an/an/a
Novartis AG
US Patent
Assay Description
In vitro activity assay using KSP.
US Patent US8546434 (2013)
BindingDB Entry DOI: 10.7270/Q25D8QG9