BDBM345391 1-cyclobutyl-4-[1-(3,5-dimethylphenyl)sulfonyl-4,5-dihydroimidazol-2-yl]piperazine::US10202354, Example 56
SMILES: Cc1cc(C)cc(c1)S(=O)(=O)N1CCN=C1N1CCN(CC1)C1CCC1
InChI Key: InChIKey=IGOQFTHTYAASLV-UHFFFAOYSA-N
Data: 1 IC50
Activity Spreadsheet -- Enzyme Inhibition Constant Data from BindingDB
Found 1 hit for monomerid = 345391
Trg + Lig
Ki
nM
ΔG°
kcal/mole
IC50
nM
Kd
nM
EC50/IC50
nM
koff
s-1
kon
M-1s-1
pHTemp
°C
Lysine-specific demethylase 2B
(Homo sapiens (Human))
BDBM345391
(1-cyclobutyl-4-[1-(3,5-dimethylphenyl)sulfonyl-4,5...)
Show SMILES Cc1cc(C)cc(c1)S(=O)(=O)N1CCN=C1N1CCN(CC1)C1CCC1 |c:15|
Show InChI InChI=1S/C19H28N4O2S/c1-15-12-16(2)14-18(13-15)26(24,25)23-7-6-20-19(23)22-10-8-21(9-11-22)17-4-3-5-17/h12-14,17H,3-11H2,1-2H3
US Patent
n/an/a 0.0880n/an/an/an/an/an/a
GENENTECH, INC.; CONSTELLATION PHARMACEUTICALS, INC.
US Patent
Assay Description
Full length KDM2B was cloned, expressed, and purified to homogeneity. Compound inhibition of KDM2B demethylase activity was assessed by monitoring th...
US Patent US10202354 (2019)
BindingDB Entry DOI: 10.7270/Q2VT1V62