null
SMILES: CCOC(=O)C1CCN(Cc2ccc(O)c3ncccc23)CC1
InChI Key: InChIKey=MMRJQIQJHVBVQY-UHFFFAOYSA-N
Activity Spreadsheet -- Enzyme Inhibition Constant Data from BindingDB
Found 7 hits for monomerid = 34569
Trg + Lig
Ki
nM
ΔG°
kcal/mole
IC50
nM
Kd
nM
EC50/IC50
nM
koff
s-1
kon
M-1s-1
pHTemp
°C
Mannose-6-phosphate isomerase
(Homo sapiens (Human))
BDBM34569
(1-(8-Hydroxy-quinolin-5-ylmethyl)-piperidine-4-car...)
Show SMILES CCOC(=O)C1CCN(Cc2ccc(O)c3ncccc23)CC1
Show InChI InChI=1S/C18H22N2O3/c1-2-23-18(22)13-7-10-20(11-8-13)12-14-5-6-16(21)17-15(14)4-3-9-19-17/h3-6,9,13,21H,2,7-8,10-12H2,1H3
Reactome pathway
PCBioAssay
n/an/a>5.00E+4n/an/an/an/a7.423
Burnham Center for Chemical Genomics
Curated by PubChem BioAssay
Assay Description
The purpose of this assay is to identify non-competititve inhibitors of human PMI. This is accomplished by using a G6PD- NADPH-coupled assay. In the ...
PubChem Bioassay (2009)
BindingDB Entry DOI: 10.7270/Q2CF9NFM
Isoform 2 of Nuclear receptor ROR-alpha (Alpha-2)
(Homo sapiens (Human))
BDBM34569
(1-(8-Hydroxy-quinolin-5-ylmethyl)-piperidine-4-car...)
Show SMILES CCOC(=O)C1CCN(Cc2ccc(O)c3ncccc23)CC1
Show InChI InChI=1S/C18H22N2O3/c1-2-23-18(22)13-7-10-20(11-8-13)12-14-5-6-16(21)17-15(14)4-3-9-19-17/h3-6,9,13,21H,2,7-8,10-12H2,1H3
Reactome pathway
PCBioAssay
n/an/a 1.29E+4n/an/an/an/an/an/a
The Scripps Research Institute Molecular Screening Center
Curated by PubChem BioAssay
Assay Description
Source (MLSCN Center Name): The Scripps Research Institute Molecular Screening Center Center Affiliation: The Scripps Research Institute, TSRI Assay ...
PubChem Bioassay (2007)
BindingDB Entry DOI: 10.7270/Q26Q1VNZ
Steroidogenic factor 1
(Homo sapiens (Human))
BDBM34569
(1-(8-Hydroxy-quinolin-5-ylmethyl)-piperidine-4-car...)
Show SMILES CCOC(=O)C1CCN(Cc2ccc(O)c3ncccc23)CC1
Show InChI InChI=1S/C18H22N2O3/c1-2-23-18(22)13-7-10-20(11-8-13)12-14-5-6-16(21)17-15(14)4-3-9-19-17/h3-6,9,13,21H,2,7-8,10-12H2,1H3
Reactome pathway
PCBioAssay
n/an/a 9.85E+3n/an/an/an/an/an/a
The Scripps Research Institute Molecular Screening Center
Curated by PubChem BioAssay
Assay Description
Source (MLSCN Center Name): The Scripps Research Institute Molecular Screening Center Center Affiliation: The Scripps Research Institute, TSRI Assay ...
PubChem Bioassay (2007)
BindingDB Entry DOI: 10.7270/Q2319T8T
Integrase
(Human immunodeficiency virus 1)
BDBM34569
(1-(8-Hydroxy-quinolin-5-ylmethyl)-piperidine-4-car...)
Show SMILES CCOC(=O)C1CCN(Cc2ccc(O)c3ncccc23)CC1
Show InChI InChI=1S/C18H22N2O3/c1-2-23-18(22)13-7-10-20(11-8-13)12-14-5-6-16(21)17-15(14)4-3-9-19-17/h3-6,9,13,21H,2,7-8,10-12H2,1H3
n/an/a>2.00E+4n/an/an/an/an/an/a
University of Southern California
Curated by ChEMBL
Assay Description
Inhibition of HIV-1 integrase 3'-processing activity
J Med Chem 56: 2311-22 (2013)
Article DOI: 10.1021/jm301632e
BindingDB Entry DOI: 10.7270/Q2348P98
ATP-dependent molecular chaperone HSP82
(Candida albicans)
BDBM34569
(1-(8-Hydroxy-quinolin-5-ylmethyl)-piperidine-4-car...)
Show SMILES CCOC(=O)C1CCN(Cc2ccc(O)c3ncccc23)CC1
Show InChI InChI=1S/C18H22N2O3/c1-2-23-18(22)13-7-10-20(11-8-13)12-14-5-6-16(21)17-15(14)4-3-9-19-17/h3-6,9,13,21H,2,7-8,10-12H2,1H3
PCBioAssay
n/an/an/an/a>1.50E+5n/an/an/an/a
Broad Institute
Curated by PubChem BioAssay
Assay Description
Broad Institute: Reversing Antifungal Drug Resistance Project ID: 2037 Keywords: Candida albicans, drug resistance, Fluconazole, Hsp90, Calcineurin, ...
PubChem Bioassay (2010)
BindingDB Entry DOI: 10.7270/Q26M358G
Integrase
(Human immunodeficiency virus 1)
BDBM34569
(1-(8-Hydroxy-quinolin-5-ylmethyl)-piperidine-4-car...)
Show SMILES CCOC(=O)C1CCN(Cc2ccc(O)c3ncccc23)CC1
Show InChI InChI=1S/C18H22N2O3/c1-2-23-18(22)13-7-10-20(11-8-13)12-14-5-6-16(21)17-15(14)4-3-9-19-17/h3-6,9,13,21H,2,7-8,10-12H2,1H3
n/an/a>2.00E+4n/an/an/an/an/an/a
University of Southern California
Curated by ChEMBL
Assay Description
Inhibition of HIV-1 integrase strand transfer activity
J Med Chem 56: 2311-22 (2013)
Article DOI: 10.1021/jm301632e
BindingDB Entry DOI: 10.7270/Q2348P98
Transcription factor p65
(Homo sapiens (Human))
BDBM34569
(1-(8-Hydroxy-quinolin-5-ylmethyl)-piperidine-4-car...)
Show SMILES CCOC(=O)C1CCN(Cc2ccc(O)c3ncccc23)CC1
Show InChI InChI=1S/C18H22N2O3/c1-2-23-18(22)13-7-10-20(11-8-13)12-14-5-6-16(21)17-15(14)4-3-9-19-17/h3-6,9,13,21H,2,7-8,10-12H2,1H3
PCBioAssay
n/an/an/an/a 2.51E+3n/an/an/an/a
SRMLSC
Curated by PubChem BioAssay
Assay Description
Southern Research Molecular Libraries Screening Center (SRMLSC) Southern Research Institute (Birmingham, Alabama) NIH Molecular Libraries Screening C...
PubChem Bioassay (2008)
BindingDB Entry DOI: 10.7270/Q27P8WT7