BDBM346015 US10202370, Example 005::[6-Methyl-2-(3- trifluoromethyl- phenyl)-3H- benzoimidazol-5-yl]- (4-pyridin-3-yl- thiazol-2-yl)-amine
SMILES: Cc1cc2nc([nH]c2cc1Nc1nc(cs1)-c1cccnc1)-c1cccc(c1)C(F)(F)F
InChI Key: InChIKey=CXXQUKWQOBSEPR-UHFFFAOYSA-N
Data: 1 EC50
Activity Spreadsheet -- Enzyme Inhibition Constant Data from BindingDB
Found 1 hit for monomerid = 346015
Trg + Lig
Ki
nM
ΔG°
kcal/mole
IC50
nM
Kd
nM
EC50/IC50
nM
koff
s-1
kon
M-1s-1
pHTemp
°C
Mast/stem cell growth factor receptor Kit
(Homo sapiens (Human))
BDBM346015
(US10202370, Example 005 | [6-Methyl-2-(3- trifluor...)
Show SMILES Cc1cc2nc([nH]c2cc1Nc1nc(cs1)-c1cccnc1)-c1cccc(c1)C(F)(F)F
Show InChI InChI=1S/C23H16F3N5S/c1-13-8-18-19(29-21(28-18)14-4-2-6-16(9-14)23(24,25)26)10-17(13)30-22-31-20(12-32-22)15-5-3-7-27-11-15/h2-12H,1H3,(H,28,29)(H,30,31)
US Patent
n/an/an/an/a<1.00E+3n/an/an/an/a
AB SCIENCE
US Patent
Assay Description
Colorimetric cell proliferation and viability assay (reagent CellTiter-Blue purchased from Promega cat N°G8081) was performed on BaF3 Kit WT cell lin...
US Patent US10202370 (2019)
BindingDB Entry DOI: 10.7270/Q2Q52RRK