null
SMILES: Cc1cc2nc([nH]c2cc1Nc1nccc(n1)-c1cccnc1)-c1cccc(Cl)c1
InChI Key: InChIKey=HJIYSCYXQGOBIR-UHFFFAOYSA-N
Activity Spreadsheet -- Enzyme Inhibition Constant Data from BindingDB
Found 1 hit for monomerid = 346026
Trg + Lig
Ki
nM
ΔG°
kcal/mole
IC50
nM
Kd
nM
EC50/IC50
nM
koff
s-1
kon
M-1s-1
pHTemp
°C
Mast/stem cell growth factor receptor Kit
(Homo sapiens (Human))
BDBM346026
(US10202370, Example 031 | [2-(3-Chloro-phenyl)- 6-...)
Show SMILES Cc1cc2nc([nH]c2cc1Nc1nccc(n1)-c1cccnc1)-c1cccc(Cl)c1
Show InChI InChI=1S/C23H17ClN6/c1-14-10-20-21(28-22(27-20)15-4-2-6-17(24)11-15)12-19(14)30-23-26-9-7-18(29-23)16-5-3-8-25-13-16/h2-13H,1H3,(H,27,28)(H,26,29,30)
US Patent
n/an/an/an/a<1.00E+3n/an/an/an/a
AB SCIENCE
US Patent
Assay Description
Colorimetric cell proliferation and viability assay (reagent CellTiter-Blue purchased from Promega cat N°G8081) was performed on BaF3 Kit WT cell lin...
US Patent US10202370 (2019)
BindingDB Entry DOI: 10.7270/Q2Q52RRK