null
SMILES: Cc1cc2n(C)c(nc2cc1Nc1nc(cs1)-c1cccnc1)-c1cccc(c1)C(F)F
InChI Key: InChIKey=JBEFYDZZJUUOAM-UHFFFAOYSA-N
Activity Spreadsheet -- Enzyme Inhibition Constant Data from BindingDB
Found 1 hit for monomerid = 346054
Trg + Lig
Ki
nM
ΔG°
kcal/mole
IC50
nM
Kd
nM
EC50/IC50
nM
koff
s-1
kon
M-1s-1
pHTemp
°C
Mast/stem cell growth factor receptor Kit
(Homo sapiens (Human))
BDBM346054
(US10202370, Example 084 | [2-(3-Difluoromethyl- ph...)
Show SMILES Cc1cc2n(C)c(nc2cc1Nc1nc(cs1)-c1cccnc1)-c1cccc(c1)C(F)F
Show InChI InChI=1S/C24H19F2N5S/c1-14-9-21-19(28-23(31(21)2)16-6-3-5-15(10-16)22(25)26)11-18(14)29-24-30-20(13-32-24)17-7-4-8-27-12-17/h3-13,22H,1-2H3,(H,29,30)
US Patent
n/an/an/an/a<1.00E+3n/an/an/an/a
AB SCIENCE
US Patent
Assay Description
Colorimetric cell proliferation and viability assay (reagent CellTiter-Blue purchased from Promega cat N°G8081) was performed on BaF3 Kit WT cell lin...
US Patent US10202370 (2019)
BindingDB Entry DOI: 10.7270/Q2Q52RRK