null
SMILES: Cc1cn(cn1)-c1cccc2[nH]c(nc12)-c1n[nH]c2cnc(cc12)-c1cncc(NC(=O)C(C)(C)C)c1
InChI Key: InChIKey=XRTDVPVLZIHWTG-UHFFFAOYSA-N
Activity Spreadsheet -- Enzyme Inhibition Constant Data from BindingDB
Found 2 hits for monomerid = 346300
Trg + Lig
Ki
nM
ΔG°
kcal/mole
IC50
nM
Kd
nM
EC50/IC50
nM
koff
s-1
kon
M-1s-1
pHTemp
°C
TGF-beta receptor type-1
(Homo sapiens (Human))
BDBM346300
(US10202377, Compound 190)
Show SMILES Cc1cn(cn1)-c1cccc2[nH]c(nc12)-c1n[nH]c2cnc(cc12)-c1cncc(NC(=O)C(C)(C)C)c1
Show InChI InChI=1S/C27H25N9O/c1-15-13-36(14-30-15)22-7-5-6-19-24(22)33-25(32-19)23-18-9-20(29-12-21(18)34-35-23)16-8-17(11-28-10-16)31-26(37)27(2,3)4/h5-14H,1-4H3,(H,31,37)(H,32,33)(H,34,35)
US Patent
n/an/an/an/a 9n/an/an/an/a
Samumed, LLC
US Patent
Assay Description
Compound Screening: Each compound was dissolved in DMSO as a 10 mM stock and used to prepare compound source plates. Serial dilution (1:2, 11-point d...
US Patent US10202377 (2019)
BindingDB Entry DOI: 10.7270/Q2639RV7
Proto-oncogene Wnt-1
(Homo sapiens (human))
BDBM346300
(US10202377, Compound 190)
Show SMILES Cc1cn(cn1)-c1cccc2[nH]c(nc12)-c1n[nH]c2cnc(cc12)-c1cncc(NC(=O)C(C)(C)C)c1
Show InChI InChI=1S/C27H25N9O/c1-15-13-36(14-30-15)22-7-5-6-19-24(22)33-25(32-19)23-18-9-20(29-12-21(18)34-35-23)16-8-17(11-28-10-16)31-26(37)27(2,3)4/h5-14H,1-4H3,(H,31,37)(H,32,33)(H,34,35)
US Patent
n/an/a 53.5n/an/an/an/an/an/a
Samumed, LLC
US Patent
Assay Description
The screening assay for Wnt activity is described as follows. Reporter cell lines can be generated by stably transducing cancer cell lines (e.g., col...
US Patent US10202377 (2019)
BindingDB Entry DOI: 10.7270/Q2639RV7