BDBM346301 US10202377, Compound 196
SMILES: Cc1cn(cn1)-c1cccc2[nH]c(nc12)-c1n[nH]c2cnc(cc12)-c1cncc(CN2CCCC2)c1
InChI Key: InChIKey=PHPZPWCRFSGVHI-UHFFFAOYSA-N
Data: 1 IC50  1 EC50
Activity Spreadsheet -- Enzyme Inhibition Constant Data from BindingDB
Found 2 hits for monomerid = 346301
Trg + Lig
Ki
nM
ΔG°
kcal/mole
IC50
nM
Kd
nM
EC50/IC50
nM
koff
s-1
kon
M-1s-1
pHTemp
°C
TGF-beta receptor type-1
(Homo sapiens (Human))
BDBM346301
(US10202377, Compound 196)
Show SMILES Cc1cn(cn1)-c1cccc2[nH]c(nc12)-c1n[nH]c2cnc(cc12)-c1cncc(CN2CCCC2)c1
Show InChI InChI=1S/C27H25N9/c1-17-14-36(16-30-17)24-6-4-5-21-26(24)32-27(31-21)25-20-10-22(29-13-23(20)33-34-25)19-9-18(11-28-12-19)15-35-7-2-3-8-35/h4-6,9-14,16H,2-3,7-8,15H2,1H3,(H,31,32)(H,33,34)
US Patent
n/an/an/an/a 9n/an/an/an/a
Samumed, LLC
US Patent
Assay Description
Compound Screening: Each compound was dissolved in DMSO as a 10 mM stock and used to prepare compound source plates. Serial dilution (1:2, 11-point d...
US Patent US10202377 (2019)
BindingDB Entry DOI: 10.7270/Q2639RV7
Proto-oncogene Wnt-1
(Homo sapiens (human))
BDBM346301
(US10202377, Compound 196)
Show SMILES Cc1cn(cn1)-c1cccc2[nH]c(nc12)-c1n[nH]c2cnc(cc12)-c1cncc(CN2CCCC2)c1
Show InChI InChI=1S/C27H25N9/c1-17-14-36(16-30-17)24-6-4-5-21-26(24)32-27(31-21)25-20-10-22(29-13-23(20)33-34-25)19-9-18(11-28-12-19)15-35-7-2-3-8-35/h4-6,9-14,16H,2-3,7-8,15H2,1H3,(H,31,32)(H,33,34)
US Patent
n/an/a 745n/an/an/an/an/an/a
Samumed, LLC
US Patent
Assay Description
The screening assay for Wnt activity is described as follows. Reporter cell lines can be generated by stably transducing cancer cell lines (e.g., col...
US Patent US10202377 (2019)
BindingDB Entry DOI: 10.7270/Q2639RV7