BDBM346934 US10202379, Reference Example 623
SMILES: C[C@@H](N1CN([C@H]2c3cccc(F)c3CSc3c(C)cccc23)n2ccc(=O)c(O)c2C1=O)C(F)(F)F
InChI Key: InChIKey=ZMTLRZOYEBBLIZ-VLIAUNLRSA-N
Data: 1 IC50  1 EC50
Activity Spreadsheet -- Enzyme Inhibition Constant Data from BindingDB
Found 2 hits for monomerid = 346934
Trg + Lig
Ki
nM
ΔG°
kcal/mole
IC50
nM
Kd
nM
EC50/IC50
nM
koff
s-1
kon
M-1s-1
pHTemp
°C
Transcription initiation factor TFIID subunit 1
(Homo sapiens (Human))
BDBM346934
(US10202379, Reference Example 623)
Show SMILES C[C@@H](N1CN([C@H]2c3cccc(F)c3CSc3c(C)cccc23)n2ccc(=O)c(O)c2C1=O)C(F)(F)F |r|
Show InChI InChI=1S/C25H21F4N3O3S/c1-13-5-3-7-16-20(15-6-4-8-18(26)17(15)11-36-23(13)16)32-12-30(14(2)25(27,28)29)24(35)21-22(34)19(33)9-10-31(21)32/h3-10,14,20,34H,11-12H2,1-2H3/t14-,20+/m1/s1
US Patent
n/an/an/an/a 3n/an/an/an/a
SHIONOGI & CO., LTD.
US Patent
Assay Description
A test sample was diluted with a culture medium to an appropriate concentration in advance, and then 2 to 5-fold serial dilution on a 96 well plate (...
US Patent US10202379 (2019)
BindingDB Entry DOI: 10.7270/Q2XK8HP2
Transcription initiation factor TFIID subunit 1
(Homo sapiens (Human))
BDBM346934
(US10202379, Reference Example 623)
Show SMILES C[C@@H](N1CN([C@H]2c3cccc(F)c3CSc3c(C)cccc23)n2ccc(=O)c(O)c2C1=O)C(F)(F)F |r|
Show InChI InChI=1S/C25H21F4N3O3S/c1-13-5-3-7-16-20(15-6-4-8-18(26)17(15)11-36-23(13)16)32-12-30(14(2)25(27,28)29)24(35)21-22(34)19(33)9-10-31(21)32/h3-10,14,20,34H,11-12H2,1-2H3/t14-,20+/m1/s1
US Patent
n/an/a 21n/an/an/an/an/an/a
SHIONOGI & CO., LTD.
US Patent
Assay Description
A test sample was diluted with a culture medium to an appropriate concentration in advance, and then 2 to 5-fold serial dilution on a 96 well plate (...
US Patent US10202379 (2019)
BindingDB Entry DOI: 10.7270/Q2XK8HP2