BDBM346956 US10202379, Reference Example 654
SMILES: C[C@@H](N1CN([C@@H]2c3ccccc3SCc3cccc(Br)c23)n2ccc(=O)c(O)c2C1=O)C(F)(F)F
InChI Key: InChIKey=KZNXLFPPOVDYMW-ZUOKHONESA-N
Data: 1 IC50  1 EC50
Activity Spreadsheet -- Enzyme Inhibition Constant Data from BindingDB
Found 2 hits for monomerid = 346956
Trg + Lig
Ki
nM
ΔG°
kcal/mole
IC50
nM
Kd
nM
EC50/IC50
nM
koff
s-1
kon
M-1s-1
pHTemp
°C
Transcription initiation factor TFIID subunit 1
(Homo sapiens (Human))
BDBM346956
(US10202379, Reference Example 654)
Show SMILES C[C@@H](N1CN([C@@H]2c3ccccc3SCc3cccc(Br)c23)n2ccc(=O)c(O)c2C1=O)C(F)(F)F |r|
Show InChI InChI=1S/C24H19BrF3N3O3S/c1-13(24(26,27)28)29-12-31(30-10-9-17(32)22(33)21(30)23(29)34)20-15-6-2-3-8-18(15)35-11-14-5-4-7-16(25)19(14)20/h2-10,13,20,33H,11-12H2,1H3/t13-,20-/m1/s1
US Patent
n/an/an/an/a 1n/an/an/an/a
SHIONOGI & CO., LTD.
US Patent
Assay Description
A test sample was diluted with a culture medium to an appropriate concentration in advance, and then 2 to 5-fold serial dilution on a 96 well plate (...
US Patent US10202379 (2019)
BindingDB Entry DOI: 10.7270/Q2XK8HP2
Transcription initiation factor TFIID subunit 1
(Homo sapiens (Human))
BDBM346956
(US10202379, Reference Example 654)
Show SMILES C[C@@H](N1CN([C@@H]2c3ccccc3SCc3cccc(Br)c23)n2ccc(=O)c(O)c2C1=O)C(F)(F)F |r|
Show InChI InChI=1S/C24H19BrF3N3O3S/c1-13(24(26,27)28)29-12-31(30-10-9-17(32)22(33)21(30)23(29)34)20-15-6-2-3-8-18(15)35-11-14-5-4-7-16(25)19(14)20/h2-10,13,20,33H,11-12H2,1H3/t13-,20-/m1/s1
US Patent
n/an/a 8n/an/an/an/an/an/a
SHIONOGI & CO., LTD.
US Patent
Assay Description
A test sample was diluted with a culture medium to an appropriate concentration in advance, and then 2 to 5-fold serial dilution on a 96 well plate (...
US Patent US10202379 (2019)
BindingDB Entry DOI: 10.7270/Q2XK8HP2