null
SMILES: CC(C)Nc1cc(ncc1-c1cnn(c1)C1CCOCC1)-c1cnc2cc(Cl)cnn12
InChI Key: InChIKey=RENRCXJODALGTE-UHFFFAOYSA-N
Activity Spreadsheet -- Enzyme Inhibition Constant Data from BindingDB
Found 1 hit for monomerid = 347047
Trg + Lig
Ki
nM
ΔG°
kcal/mole
IC50
nM
Kd
nM
EC50/IC50
nM
koff
s-1
kon
M-1s-1
pHTemp
°C
G protein-activated inward rectifier potassium channel 4
(Homo sapiens (Human))
BDBM347047
(2-(7-chloroimidazo[1,2-b]pyridazin-3-yl)-N-isoprop...)
Show SMILES CC(C)Nc1cc(ncc1-c1cnn(c1)C1CCOCC1)-c1cnc2cc(Cl)cnn12
Show InChI InChI=1S/C22H24ClN7O/c1-14(2)28-19-8-20(21-12-25-22-7-16(23)10-27-30(21)22)24-11-18(19)15-9-26-29(13-15)17-3-5-31-6-4-17/h7-14,17H,3-6H2,1-2H3,(H,24,28)
Reactome pathway
US Patent
n/an/a 63n/an/an/an/an/an/a
Bristol-Myers Squibb Company
US Patent
Assay Description
TBD
US Patent US10202390 (2019)
BindingDB Entry DOI: 10.7270/Q28W3GDC