null
SMILES: CC(C)Nc1cc(ncc1-c1cnn(CC(F)(F)F)c1)-c1cnc2cc(cnn12)C#N
InChI Key: InChIKey=PJWHSDHTZZMZIM-UHFFFAOYSA-N
Activity Spreadsheet -- Enzyme Inhibition Constant Data from BindingDB
Found 2 hits for monomerid = 347052
Trg + Lig
Ki
nM
ΔG°
kcal/mole
IC50
nM
Kd
nM
EC50/IC50
nM
koff
s-1
kon
M-1s-1
pHTemp
°C
G protein-activated inward rectifier potassium channel 4
(Homo sapiens (Human))
BDBM347052
(US10202390, Example 7 | US10202390, Example 8)
Show SMILES CC(C)Nc1cc(ncc1-c1cnn(CC(F)(F)F)c1)-c1cnc2cc(cnn12)C#N
Show InChI InChI=1S/C20H17F3N8/c1-12(2)29-16-4-17(18-9-26-19-3-13(5-24)6-28-31(18)19)25-8-15(16)14-7-27-30(10-14)11-20(21,22)23/h3-4,6-10,12H,11H2,1-2H3,(H,25,29)
Reactome pathway
US Patent
n/an/a 43n/an/an/an/an/an/a
Bristol-Myers Squibb Company
US Patent
Assay Description
TBD
US Patent US10202390 (2019)
BindingDB Entry DOI: 10.7270/Q28W3GDC
G protein-activated inward rectifier potassium channel 4
(Homo sapiens (Human))
BDBM347052
(US10202390, Example 7 | US10202390, Example 8)
Show SMILES CC(C)Nc1cc(ncc1-c1cnn(CC(F)(F)F)c1)-c1cnc2cc(cnn12)C#N
Show InChI InChI=1S/C20H17F3N8/c1-12(2)29-16-4-17(18-9-26-19-3-13(5-24)6-28-31(18)19)25-8-15(16)14-7-27-30(10-14)11-20(21,22)23/h3-4,6-10,12H,11H2,1-2H3,(H,25,29)
Reactome pathway
US Patent
n/an/a 53n/an/an/an/an/an/a
Bristol-Myers Squibb Company
US Patent
Assay Description
TBD
US Patent US10202390 (2019)
BindingDB Entry DOI: 10.7270/Q28W3GDC