null
SMILES: CC(C)(O)CCc1cn(nn1)-c1cnc(cc1NC1CCOCC1)-c1cnn2cc(Cl)cnc12
InChI Key: InChIKey=CCXZYUPDEZUPCM-UHFFFAOYSA-N
Activity Spreadsheet -- Enzyme Inhibition Constant Data from BindingDB
Found 1 hit for monomerid = 347068
Trg + Lig
Ki
nM
ΔG°
kcal/mole
IC50
nM
Kd
nM
EC50/IC50
nM
koff
s-1
kon
M-1s-1
pHTemp
°C
G protein-activated inward rectifier potassium channel 4
(Homo sapiens (Human))
BDBM347068
(US10202390, Example 23)
Show SMILES CC(C)(O)CCc1cn(nn1)-c1cnc(cc1NC1CCOCC1)-c1cnn2cc(Cl)cnc12
Show InChI InChI=1S/C23H27ClN8O2/c1-23(2,33)6-3-17-14-31(30-29-17)21-12-25-19(9-20(21)28-16-4-7-34-8-5-16)18-11-27-32-13-15(24)10-26-22(18)32/h9-14,16,33H,3-8H2,1-2H3,(H,25,28)
Reactome pathway
US Patent
n/an/a 9n/an/an/an/an/an/a
Bristol-Myers Squibb Company
US Patent
Assay Description
TBD
US Patent US10202390 (2019)
BindingDB Entry DOI: 10.7270/Q28W3GDC