BDBM347070 US10202390, Example 25
SMILES: CC(C)(O)CCc1cn(nn1)-c1cnc(cc1N[C@H]1CC[C@H](F)C1)-c1cnn2cc(cnc12)C#N
InChI Key: InChIKey=PRAAEKYPJNFSSE-IRXDYDNUSA-N
Data: 1 IC50
Activity Spreadsheet -- Enzyme Inhibition Constant Data from BindingDB
Found 1 hit for monomerid = 347070
Trg + Lig
Ki
nM
ΔG°
kcal/mole
IC50
nM
Kd
nM
EC50/IC50
nM
koff
s-1
kon
M-1s-1
pHTemp
°C
G protein-activated inward rectifier potassium channel 4
(Homo sapiens (Human))
BDBM347070
(US10202390, Example 25)
Show SMILES CC(C)(O)CCc1cn(nn1)-c1cnc(cc1N[C@H]1CC[C@H](F)C1)-c1cnn2cc(cnc12)C#N |r|
Show InChI InChI=1S/C24H26FN9O/c1-24(2,35)6-5-18-14-33(32-31-18)22-12-27-20(8-21(22)30-17-4-3-16(25)7-17)19-11-29-34-13-15(9-26)10-28-23(19)34/h8,10-14,16-17,35H,3-7H2,1-2H3,(H,27,30)/t16-,17-/m0/s1
Reactome pathway
US Patent
n/an/a 5n/an/an/an/an/an/a
Bristol-Myers Squibb Company
US Patent
Assay Description
TBD
US Patent US10202390 (2019)
BindingDB Entry DOI: 10.7270/Q28W3GDC