BDBM3471 1-[6-(2,6-dichlorophenyl)-2-{[3-(4-methylpiperazin-1-yl)propyl]amino}pyrido[2,3-d]pyrimidin-7-yl]-3-propan-2-ylurea::6-arylpyrido[2,3-d]pyrimidine deriv. 53
SMILES: CC(C)NC(=O)Nc1nc2nc(NCCCN3CCN(C)CC3)ncc2cc1-c1c(Cl)cccc1Cl
InChI Key: InChIKey=MEGWJRRCEUYDCB-UHFFFAOYSA-N
Data: 3 IC50
Activity Spreadsheet -- Enzyme Inhibition Constant Data from BindingDB
Found 3 hits for monomerid = 3471
Trg + Lig
Ki
nM
ΔG°
kcal/mole
IC50
nM
Kd
nM
EC50/IC50
nM
koff
s-1
kon
M-1s-1
pHTemp
°C
Platelet-derived growth factor receptor beta
(Homo sapiens (Human))
BDBM3471
(1-[6-(2,6-dichlorophenyl)-2-{[3-(4-methylpiperazin...)
Show SMILES CC(C)NC(=O)Nc1nc2nc(NCCCN3CCN(C)CC3)ncc2cc1-c1c(Cl)cccc1Cl |(5.49,-4.29,;4.16,-3.52,;2.83,-4.29,;4.16,-1.98,;2.83,-1.21,;1.49,-1.98,;2.83,.33,;1.49,1.1,;.16,.33,;-1.17,1.1,;-2.51,.33,;-3.84,1.1,;-5.18,.33,;-6.51,1.1,;-8,.7,;-9.09,1.79,;-10.57,1.39,;-11.87,2.22,;-13.24,1.51,;-13.31,-.03,;-14.64,-.8,;-12.01,-.86,;-10.64,-.15,;-3.84,2.64,;-2.51,3.41,;-1.17,2.64,;.16,3.41,;1.49,2.64,;2.83,3.41,;2.83,4.95,;1.49,5.72,;4.16,5.72,;5.49,4.95,;5.49,3.41,;4.16,2.64,;4.16,1.1,)|
Show InChI InChI=1S/C25H32Cl2N8O/c1-16(2)30-25(36)33-23-18(21-19(26)6-4-7-20(21)27)14-17-15-29-24(32-22(17)31-23)28-8-5-9-35-12-10-34(3)11-13-35/h4,6-7,14-16H,5,8-13H2,1-3H3,(H3,28,29,30,31,32,33,36)
NCI pathway
Reactome pathway
n/an/a 550n/an/an/an/an/an/a
Pfizer
Assay Description
IC50 is the inhibitor concentration which inhibits 50% of kinase activity that catalyzes the transfer of the terminal phosphate from [gamma-32P] labe...
J Med Chem 44: 1915-26 (2001)
Article DOI: 10.1021/jm0004291
BindingDB Entry DOI: 10.7270/Q29K48DG
Proto-oncogene tyrosine-protein kinase Src
(Homo sapiens (Human))
BDBM3471
(1-[6-(2,6-dichlorophenyl)-2-{[3-(4-methylpiperazin...)
Show SMILES CC(C)NC(=O)Nc1nc2nc(NCCCN3CCN(C)CC3)ncc2cc1-c1c(Cl)cccc1Cl |(5.49,-4.29,;4.16,-3.52,;2.83,-4.29,;4.16,-1.98,;2.83,-1.21,;1.49,-1.98,;2.83,.33,;1.49,1.1,;.16,.33,;-1.17,1.1,;-2.51,.33,;-3.84,1.1,;-5.18,.33,;-6.51,1.1,;-8,.7,;-9.09,1.79,;-10.57,1.39,;-11.87,2.22,;-13.24,1.51,;-13.31,-.03,;-14.64,-.8,;-12.01,-.86,;-10.64,-.15,;-3.84,2.64,;-2.51,3.41,;-1.17,2.64,;.16,3.41,;1.49,2.64,;2.83,3.41,;2.83,4.95,;1.49,5.72,;4.16,5.72,;5.49,4.95,;5.49,3.41,;4.16,2.64,;4.16,1.1,)|
Show InChI InChI=1S/C25H32Cl2N8O/c1-16(2)30-25(36)33-23-18(21-19(26)6-4-7-20(21)27)14-17-15-29-24(32-22(17)31-23)28-8-5-9-35-12-10-34(3)11-13-35/h4,6-7,14-16H,5,8-13H2,1-3H3,(H3,28,29,30,31,32,33,36)
n/an/a 19n/an/an/an/an/an/a
Pfizer
Assay Description
IC50 is the inhibitor concentration which inhibits 50% of kinase activity that catalyzes the transfer of the terminal phosphate from [gamma-32P] labe...
J Med Chem 44: 1915-26 (2001)
Article DOI: 10.1021/jm0004291
BindingDB Entry DOI: 10.7270/Q29K48DG
Fibroblast growth factor receptor 1
(Homo sapiens (Human))
BDBM3471
(1-[6-(2,6-dichlorophenyl)-2-{[3-(4-methylpiperazin...)
Show SMILES CC(C)NC(=O)Nc1nc2nc(NCCCN3CCN(C)CC3)ncc2cc1-c1c(Cl)cccc1Cl |(5.49,-4.29,;4.16,-3.52,;2.83,-4.29,;4.16,-1.98,;2.83,-1.21,;1.49,-1.98,;2.83,.33,;1.49,1.1,;.16,.33,;-1.17,1.1,;-2.51,.33,;-3.84,1.1,;-5.18,.33,;-6.51,1.1,;-8,.7,;-9.09,1.79,;-10.57,1.39,;-11.87,2.22,;-13.24,1.51,;-13.31,-.03,;-14.64,-.8,;-12.01,-.86,;-10.64,-.15,;-3.84,2.64,;-2.51,3.41,;-1.17,2.64,;.16,3.41,;1.49,2.64,;2.83,3.41,;2.83,4.95,;1.49,5.72,;4.16,5.72,;5.49,4.95,;5.49,3.41,;4.16,2.64,;4.16,1.1,)|
Show InChI InChI=1S/C25H32Cl2N8O/c1-16(2)30-25(36)33-23-18(21-19(26)6-4-7-20(21)27)14-17-15-29-24(32-22(17)31-23)28-8-5-9-35-12-10-34(3)11-13-35/h4,6-7,14-16H,5,8-13H2,1-3H3,(H3,28,29,30,31,32,33,36)
NCI pathway
Reactome pathway
n/an/a 34n/an/an/an/an/an/a
Pfizer
Assay Description
IC50 is the inhibitor concentration which inhibits 50% of kinase activity that catalyzes the transfer of the terminal phosphate from [gamma-32P] labe...
J Med Chem 44: 1915-26 (2001)
Article DOI: 10.1021/jm0004291
BindingDB Entry DOI: 10.7270/Q29K48DG