BDBM347125 2-(4-((3-(4-isopropylpiperazin-1- yl)phenyl)(methyl)amino)phenoxy) pyrido[3,4-d]pyrimidin-4-ol::US10202381, Example 132::US10208039, Example 132
SMILES: CC(C)N1CCN(CC1)c1cccc(c1)N(C)c1ccc(Oc2nc(O)c3ccncc3n2)cc1
InChI Key: InChIKey=PJQNDBNJFCXLPU-UHFFFAOYSA-N
Data: 2 IC50
Activity Spreadsheet -- Enzyme Inhibition Constant Data from BindingDB
Found 2 hits for monomerid = 347125
Trg + Lig
Ki
nM
ΔG°
kcal/mole
IC50
nM
Kd
nM
EC50/IC50
nM
koff
s-1
kon
M-1s-1
pHTemp
°C
Lysine-specific demethylase 4C
(Homo sapiens (Human))
BDBM347125
(2-(4-((3-(4-isopropylpiperazin-1- yl)phenyl)(methy...)
Show SMILES CC(C)N1CCN(CC1)c1cccc(c1)N(C)c1ccc(Oc2nc(O)c3ccncc3n2)cc1
Show InChI InChI=1S/C27H30N6O2/c1-19(2)32-13-15-33(16-14-32)22-6-4-5-21(17-22)31(3)20-7-9-23(10-8-20)35-27-29-25-18-28-12-11-24(25)26(34)30-27/h4-12,17-19H,13-16H2,1-3H3,(H,29,30,34)
US Patent
n/an/a<100n/an/an/an/an/an/a
Celgene Quanticel Research, Inc.
US Patent
Assay Description
The ability of test compounds to inhibit the activity of JMJD2C was determined in 384-well plate-format under the following reaction conditions: 0.3 ...
US Patent US10208039 (2019)
BindingDB Entry DOI: 10.7270/Q241706J
Lysine-specific demethylase 4C
(Homo sapiens (Human))
BDBM347125
(2-(4-((3-(4-isopropylpiperazin-1- yl)phenyl)(methy...)
Show SMILES CC(C)N1CCN(CC1)c1cccc(c1)N(C)c1ccc(Oc2nc(O)c3ccncc3n2)cc1
Show InChI InChI=1S/C27H30N6O2/c1-19(2)32-13-15-33(16-14-32)22-6-4-5-21(17-22)31(3)20-7-9-23(10-8-20)35-27-29-25-18-28-12-11-24(25)26(34)30-27/h4-12,17-19H,13-16H2,1-3H3,(H,29,30,34)
US Patent
n/an/a<100n/an/an/an/an/an/a
CELGENE QUANTICEL RESEARCH, INC.
US Patent
Assay Description
The ability of test compounds to inhibit the activity of JMJD2C was determined in 384-well plate-format under the following reaction conditions: 0.3 ...
US Patent US10202381 (2019)
BindingDB Entry DOI: 10.7270/Q2SX6GBM