null
SMILES: CN(c1cccc(c1)N1CCN(C)CC1)c1ccc(Oc2nc(O)c3ccncc3n2)cc1C(F)(F)F
InChI Key: InChIKey=YKRZXSSMPBSNJT-UHFFFAOYSA-N
Activity Spreadsheet -- Enzyme Inhibition Constant Data from BindingDB
Found 2 hits for monomerid = 347126
Trg + Lig
Ki
nM
ΔG°
kcal/mole
IC50
nM
Kd
nM
EC50/IC50
nM
koff
s-1
kon
M-1s-1
pHTemp
°C
Lysine-specific demethylase 4C
(Homo sapiens (Human))
BDBM347126
(2-(4-(methyl(3-(4-methylpiperazin-1- yl)phenyl)ami...)
Show SMILES CN(c1cccc(c1)N1CCN(C)CC1)c1ccc(Oc2nc(O)c3ccncc3n2)cc1C(F)(F)F
Show InChI InChI=1S/C26H25F3N6O2/c1-33-10-12-35(13-11-33)18-5-3-4-17(14-18)34(2)23-7-6-19(15-21(23)26(27,28)29)37-25-31-22-16-30-9-8-20(22)24(36)32-25/h3-9,14-16H,10-13H2,1-2H3,(H,31,32,36)
US Patent
n/an/a<100n/an/an/an/an/an/a
Celgene Quanticel Research, Inc.
US Patent
Assay Description
The ability of test compounds to inhibit the activity of JMJD2C was determined in 384-well plate-format under the following reaction conditions: 0.3 ...
US Patent US10208039 (2019)
BindingDB Entry DOI: 10.7270/Q241706J
Lysine-specific demethylase 4C
(Homo sapiens (Human))
BDBM347126
(2-(4-(methyl(3-(4-methylpiperazin-1- yl)phenyl)ami...)
Show SMILES CN(c1cccc(c1)N1CCN(C)CC1)c1ccc(Oc2nc(O)c3ccncc3n2)cc1C(F)(F)F
Show InChI InChI=1S/C26H25F3N6O2/c1-33-10-12-35(13-11-33)18-5-3-4-17(14-18)34(2)23-7-6-19(15-21(23)26(27,28)29)37-25-31-22-16-30-9-8-20(22)24(36)32-25/h3-9,14-16H,10-13H2,1-2H3,(H,31,32,36)
US Patent
n/an/a<100n/an/an/an/an/an/a
CELGENE QUANTICEL RESEARCH, INC.
US Patent
Assay Description
The ability of test compounds to inhibit the activity of JMJD2C was determined in 384-well plate-format under the following reaction conditions: 0.3 ...
US Patent US10202381 (2019)
BindingDB Entry DOI: 10.7270/Q2SX6GBM