null
SMILES: C[C@H]1CCO[C@@H]2Cn3cc(-c4nnc(Cc5ccc(F)c(Cl)c5F)s4)c(=O)c(O)c3C(=O)N12
InChI Key: InChIKey=HTEYIDZBQURBHT-LKFCYVNXSA-N
Activity Spreadsheet -- Enzyme Inhibition Constant Data from BindingDB
Found 1 hit for monomerid = 347165
Trg + Lig
Ki
nM
ΔG°
kcal/mole
IC50
nM
Kd
nM
EC50/IC50
nM
koff
s-1
kon
M-1s-1
pHTemp
°C
Gag-Pol polyprotein
(Human immunodeficiency virus type 1 group M subtyp...)
BDBM347165
(US10202404, Compound A-37)
Show SMILES C[C@H]1CCO[C@@H]2Cn3cc(-c4nnc(Cc5ccc(F)c(Cl)c5F)s4)c(=O)c(O)c3C(=O)N12 |r|
Show InChI InChI=1S/C21H17ClF2N4O4S/c1-9-4-5-32-14-8-27-7-11(18(29)19(30)17(27)21(31)28(9)14)20-26-25-13(33-20)6-10-2-3-12(23)15(22)16(10)24/h2-3,7,9,14,30H,4-6,8H2,1H3/t9-,14+/m0/s1
US Patent
n/an/an/an/a 2.30n/an/an/an/a
SHIONOGI & CO., LTD.
US Patent
Assay Description
Previously, a series of two-fold dilution on test samples were carried out in a 96-well plate (50 μL/well). Two plates were made for measuring a...
US Patent US10202404 (2019)
BindingDB Entry DOI: 10.7270/Q2WQ05WN