BDBM347187 US10202404, Compound A-60
SMILES: C[C@H]1CN(C2CC2)[C@@H]2Cn3cc(-c4nnc(Cc5ccc(F)cc5F)s4)c(=O)c(O)c3C(=O)N12
InChI Key: InChIKey=HMBZVYUDZIKZHK-VOJFVSQTSA-N
Data: 1 EC50
Activity Spreadsheet -- Enzyme Inhibition Constant Data from BindingDB
Found 1 hit for monomerid = 347187
Trg + Lig
Ki
nM
ΔG°
kcal/mole
IC50
nM
Kd
nM
EC50/IC50
nM
koff
s-1
kon
M-1s-1
pHTemp
°C
Gag-Pol polyprotein
(Human immunodeficiency virus type 1 group M subtyp...)
BDBM347187
(US10202404, Compound A-60)
Show SMILES C[C@H]1CN(C2CC2)[C@@H]2Cn3cc(-c4nnc(Cc5ccc(F)cc5F)s4)c(=O)c(O)c3C(=O)N12 |r|
Show InChI InChI=1S/C23H21F2N5O3S/c1-11-8-29(14-4-5-14)18-10-28-9-15(20(31)21(32)19(28)23(33)30(11)18)22-27-26-17(34-22)6-12-2-3-13(24)7-16(12)25/h2-3,7,9,11,14,18,32H,4-6,8,10H2,1H3/t11-,18-/m0/s1
US Patent
n/an/an/an/a 2n/an/an/an/a
SHIONOGI & CO., LTD.
US Patent
Assay Description
Previously, a series of two-fold dilution on test samples were carried out in a 96-well plate (50 μL/well). Two plates were made for measuring a...
US Patent US10202404 (2019)
BindingDB Entry DOI: 10.7270/Q2WQ05WN