BDBM347391 US10869871, ID # SW208496::US9789116, SW208496
SMILES: CCCCS(=O)c1sc2nc(cc(-c3ccccc3)c2c1N)-c1ncco1
InChI Key: InChIKey=CCQMRIVQGYIMSI-UHFFFAOYSA-N
Data: 2 IC50
Activity Spreadsheet -- Enzyme Inhibition Constant Data from BindingDB
Found 2 hits for monomerid = 347391
Trg + Lig
Ki
nM
ΔG°
kcal/mole
IC50
nM
Kd
nM
EC50/IC50
nM
koff
s-1
kon
M-1s-1
pHTemp
°C
15-hydroxyprostaglandin dehydrogenase [NAD+]
(Homo sapiens (Human))
BDBM347391
(US10869871, ID # SW208496 | US9789116, SW208496)
Show SMILES CCCCS(=O)c1sc2nc(cc(-c3ccccc3)c2c1N)-c1ncco1
Show InChI InChI=1S/C20H19N3O2S2/c1-2-3-11-27(24)20-17(21)16-14(13-7-5-4-6-8-13)12-15(23-19(16)26-20)18-22-9-10-25-18/h4-10,12H,2-3,11,21H2,1H3
Reactome pathway
US Patent
n/an/a 1.37n/an/an/an/an/an/a
CASE WESTERN RESERVE UNIVERSITY; THE BOARD OF REGENTS OF THE UNIVERSITY OF TEXAS SYSTEM
US Patent
Assay Description
Assays were done by measuring the transfer of tritium from 15(S)-[15-3H] PGE2 to glutamate (at 1 μM PGE2 substrate), or by direct fluorescence m...
US Patent US10869871 (2020)
15-hydroxyprostaglandin dehydrogenase [NAD+]
(Homo sapiens (Human))
BDBM347391
(US10869871, ID # SW208496 | US9789116, SW208496)
Show SMILES CCCCS(=O)c1sc2nc(cc(-c3ccccc3)c2c1N)-c1ncco1
Show InChI InChI=1S/C20H19N3O2S2/c1-2-3-11-27(24)20-17(21)16-14(13-7-5-4-6-8-13)12-15(23-19(16)26-20)18-22-9-10-25-18/h4-10,12H,2-3,11,21H2,1H3
Reactome pathway
US Patent
n/an/a 1.37n/an/an/an/an/an/a
Case Western Reserve University; Board of Regents of the University of Texas System
US Patent
Assay Description
Each compound for inhibiting enzymatic activity of recombinant 15-PGDH in an in vitro assay.
US Patent US9789116 (2017)
BindingDB Entry DOI: 10.7270/Q2VQ34T5