null
SMILES: CCCS(=O)c1sc2nc(cc(C(=O)OCC)c2c1N)-c1cccs1
InChI Key: InChIKey=GAZFYONUHWJNBP-UHFFFAOYSA-N
Activity Spreadsheet -- Enzyme Inhibition Constant Data from BindingDB
Found 2 hits for monomerid = 347402
Trg + Lig
Ki
nM
ΔG°
kcal/mole
IC50
nM
Kd
nM
EC50/IC50
nM
koff
s-1
kon
M-1s-1
pHTemp
°C
15-hydroxyprostaglandin dehydrogenase [NAD(+)]
(Homo sapiens (Human))
BDBM347402
(US10869871, ID # SW208781 | US9789116, SW208781)
Show SMILES CCCS(=O)c1sc2nc(cc(C(=O)OCC)c2c1N)-c1cccs1
Show InChI InChI=1S/C17H18N2O3S3/c1-3-8-25(21)17-14(18)13-10(16(20)22-4-2)9-11(19-15(13)24-17)12-6-5-7-23-12/h5-7,9H,3-4,8,18H2,1-2H3
Reactome pathway
US Patent
n/an/a 1.99n/an/an/an/an/an/a
CASE WESTERN RESERVE UNIVERSITY; THE BOARD OF REGENTS OF THE UNIVERSITY OF TEXAS SYSTEM
US Patent
Assay Description
Assays were done by measuring the transfer of tritium from 15(S)-[15-3H] PGE2 to glutamate (at 1 μM PGE2 substrate), or by direct fluorescence m...
US Patent US10869871 (2020)
15-hydroxyprostaglandin dehydrogenase [NAD(+)]
(Homo sapiens (Human))
BDBM347402
(US10869871, ID # SW208781 | US9789116, SW208781)
Show SMILES CCCS(=O)c1sc2nc(cc(C(=O)OCC)c2c1N)-c1cccs1
Show InChI InChI=1S/C17H18N2O3S3/c1-3-8-25(21)17-14(18)13-10(16(20)22-4-2)9-11(19-15(13)24-17)12-6-5-7-23-12/h5-7,9H,3-4,8,18H2,1-2H3
Reactome pathway
US Patent
n/an/a 1.99n/an/an/an/an/an/a
Case Western Reserve University; Board of Regents of the University of Texas System
US Patent
Assay Description
Each compound for inhibiting enzymatic activity of recombinant 15-PGDH in an in vitro assay.
US Patent US9789116 (2017)
BindingDB Entry DOI: 10.7270/Q2VQ34T5