null
SMILES: Nc1c(sc2nc(cc(-c3ccccc3)c12)-c1cccs1)[S+]([O-])CCCCl
InChI Key: InChIKey=SSYPLCSGHBXZTD-UHFFFAOYSA-N
Activity Spreadsheet -- Enzyme Inhibition Constant Data from BindingDB
Found 3 hits for monomerid = 347425
Trg + Lig
Ki
nM
ΔG°
kcal/mole
IC50
nM
Kd
nM
EC50/IC50
nM
koff
s-1
kon
M-1s-1
pHTemp
°C
15-hydroxyprostaglandin dehydrogenase [NAD(+)]
(Homo sapiens (Human))
BDBM347425
(US10869871, ID # SW209330 | US9789116, SW209330)
Show SMILES Nc1c(sc2nc(cc(-c3ccccc3)c12)-c1cccs1)[S+]([O-])CCCCl
Show InChI InChI=1S/C20H17ClN2OS3/c21-9-5-11-27(24)20-18(22)17-14(13-6-2-1-3-7-13)12-15(23-19(17)26-20)16-8-4-10-25-16/h1-4,6-8,10,12H,5,9,11,22H2
Reactome pathway
US Patent
n/an/a 4.01n/an/an/an/an/an/a
Case Western Reserve University; Board of Regents of the University of Texas System
US Patent
Assay Description
Each compound for inhibiting enzymatic activity of recombinant 15-PGDH in an in vitro assay.
US Patent US9789116 (2017)
BindingDB Entry DOI: 10.7270/Q2VQ34T5
15-hydroxyprostaglandin dehydrogenase [NAD(+)]
(Homo sapiens (Human))
BDBM347425
(US10869871, ID # SW209330 | US9789116, SW209330)
Show SMILES Nc1c(sc2nc(cc(-c3ccccc3)c12)-c1cccs1)[S+]([O-])CCCCl
Show InChI InChI=1S/C20H17ClN2OS3/c21-9-5-11-27(24)20-18(22)17-14(13-6-2-1-3-7-13)12-15(23-19(17)26-20)16-8-4-10-25-16/h1-4,6-8,10,12H,5,9,11,22H2
Reactome pathway
US Patent
n/an/a 4.01n/an/an/an/an/an/a
CASE WESTERN RESERVE UNIVERSITY; THE BOARD OF REGENTS OF THE UNIVERSITY OF TEXAS SYSTEM
US Patent
Assay Description
Assays were done by measuring the transfer of tritium from 15(S)-[15-3H] PGE2 to glutamate (at 1 μM PGE2 substrate), or by direct fluorescence m...
US Patent US10869871 (2020)
15-hydroxyprostaglandin dehydrogenase [NAD(+)]
(Homo sapiens (Human))
BDBM347425
(US10869871, ID # SW209330 | US9789116, SW209330)
Show SMILES Nc1c(sc2nc(cc(-c3ccccc3)c12)-c1cccs1)[S+]([O-])CCCCl
Show InChI InChI=1S/C20H17ClN2OS3/c21-9-5-11-27(24)20-18(22)17-14(13-6-2-1-3-7-13)12-15(23-19(17)26-20)16-8-4-10-25-16/h1-4,6-8,10,12H,5,9,11,22H2
Reactome pathway
n/an/a 4n/an/an/an/an/an/a
UT Southwestern Medical Center
Curated by ChEMBL
Assay Description
Inhibition of recombinant human C-terminal 6xHis-tagged 15-PGDH expressed in Escherichia coli using PGE2 as substrate after 15 mins in presence of NA...
J Med Chem 60: 3979-4001 (2017)
Article DOI: 10.1021/acs.jmedchem.7b00271
BindingDB Entry DOI: 10.7270/Q2280B21