BDBM347448 US10869871, ID # SW212366::US9789116, SW212366
SMILES: CCCCS(=O)c1sc2nc(cc(-c3ccc(COC(=O)CN(C)C)cc3)c2c1N)-c1nccs1
InChI Key: InChIKey=ILJZLKLCIPROFV-UHFFFAOYSA-N
Data: 2 IC50
Activity Spreadsheet -- Enzyme Inhibition Constant Data from BindingDB
Found 2 hits for monomerid = 347448
Trg + Lig
Ki
nM
ΔG°
kcal/mole
IC50
nM
Kd
nM
EC50/IC50
nM
koff
s-1
kon
M-1s-1
pHTemp
°C
15-hydroxyprostaglandin dehydrogenase [NAD(+)]
(Homo sapiens (Human))
BDBM347448
(US10869871, ID # SW212366 | US9789116, SW212366)
Show SMILES CCCCS(=O)c1sc2nc(cc(-c3ccc(COC(=O)CN(C)C)cc3)c2c1N)-c1nccs1
Show InChI InChI=1S/C25H28N4O3S3/c1-4-5-12-35(31)25-22(26)21-18(13-19(28-24(21)34-25)23-27-10-11-33-23)17-8-6-16(7-9-17)15-32-20(30)14-29(2)3/h6-11,13H,4-5,12,14-15,26H2,1-3H3
Reactome pathway
US Patent
n/an/a 3.48n/an/an/an/an/an/a
CASE WESTERN RESERVE UNIVERSITY; THE BOARD OF REGENTS OF THE UNIVERSITY OF TEXAS SYSTEM
US Patent
Assay Description
Assays were done by measuring the transfer of tritium from 15(S)-[15-3H] PGE2 to glutamate (at 1 μM PGE2 substrate), or by direct fluorescence m...
US Patent US10869871 (2020)
15-hydroxyprostaglandin dehydrogenase [NAD(+)]
(Homo sapiens (Human))
BDBM347448
(US10869871, ID # SW212366 | US9789116, SW212366)
Show SMILES CCCCS(=O)c1sc2nc(cc(-c3ccc(COC(=O)CN(C)C)cc3)c2c1N)-c1nccs1
Show InChI InChI=1S/C25H28N4O3S3/c1-4-5-12-35(31)25-22(26)21-18(13-19(28-24(21)34-25)23-27-10-11-33-23)17-8-6-16(7-9-17)15-32-20(30)14-29(2)3/h6-11,13H,4-5,12,14-15,26H2,1-3H3
Reactome pathway
US Patent
n/an/a 3.48n/an/an/an/an/an/a
Case Western Reserve University; Board of Regents of the University of Texas System
US Patent
Assay Description
Each compound for inhibiting enzymatic activity of recombinant 15-PGDH in an in vitro assay.
US Patent US9789116 (2017)
BindingDB Entry DOI: 10.7270/Q2VQ34T5