null
SMILES: CN(C)\C=C(\Oc1ccc(Cl)cc1)C(=O)c1ccc(Cl)cc1F
InChI Key: InChIKey=QTWGJPLIAWDVSU-MHWRWJLKSA-N
Activity Spreadsheet -- Enzyme Inhibition Constant Data from BindingDB
Found 2 hits for monomerid = 347688
Trg + Lig
Ki
nM
ΔG°
kcal/mole
IC50
nM
Kd
nM
EC50/IC50
nM
koff
s-1
kon
M-1s-1
pHTemp
°C
Cytochrome P450 11B1, mitochondrial
(Homo sapiens (Human))
BDBM347688
((E)-1-(4-Chloro-2-fluoro-phenyl)-2- (4-chloropheno...)
Show SMILES CN(C)\C=C(\Oc1ccc(Cl)cc1)C(=O)c1ccc(Cl)cc1F
Show InChI InChI=1S/C17H14Cl2FNO2/c1-21(2)10-16(23-13-6-3-11(18)4-7-13)17(22)14-8-5-12(19)9-15(14)20/h3-10H,1-2H3/b16-10+
US Patent
n/an/an/an/a 0.433n/an/an/an/a
Hoffmann-La Roche Inc.
US Patent
Assay Description
G-402 cells can be obtained from ATCC (CRL-1440) and were originally derived from a renal leiomyoblastoma.The expression plasmids contains the ORF fo...
US Patent US9790217 (2017)
BindingDB Entry DOI: 10.7270/Q2K64M6M
Cytochrome P450 11B2, mitochondrial
(Homo sapiens (Human))
BDBM347688
((E)-1-(4-Chloro-2-fluoro-phenyl)-2- (4-chloropheno...)
Show SMILES CN(C)\C=C(\Oc1ccc(Cl)cc1)C(=O)c1ccc(Cl)cc1F
Show InChI InChI=1S/C17H14Cl2FNO2/c1-21(2)10-16(23-13-6-3-11(18)4-7-13)17(22)14-8-5-12(19)9-15(14)20/h3-10H,1-2H3/b16-10+
US Patent
n/an/an/an/a 0.0460n/an/an/an/a
Hoffmann-La Roche Inc.
US Patent
Assay Description
G-402 cells can be obtained from ATCC (CRL-1440) and were originally derived from a renal leiomyoblastoma.The expression plasmids contains the ORF fo...
US Patent US9790217 (2017)
BindingDB Entry DOI: 10.7270/Q2K64M6M