BDBM347754 4-[[3-[2-(Pyridin-4-ylmethoxy)phenyl]-1H-pyrazol-4-yl]oxy]benzonitrile::US9790217, 76
SMILES: N#Cc1ccc(Oc2cn[nH]c2-c2ccccc2OCc2ccncc2)cc1
InChI Key: InChIKey=ZWPKKHNEWUWGGH-UHFFFAOYSA-N
Data: 2 EC50
Activity Spreadsheet -- Enzyme Inhibition Constant Data from BindingDB
Found 2 hits for monomerid = 347754
Trg + Lig
Ki
nM
ΔG°
kcal/mole
IC50
nM
Kd
nM
EC50/IC50
nM
koff
s-1
kon
M-1s-1
pHTemp
°C
Cytochrome P450 11B1
(Homo sapiens (Human))
BDBM347754
(4-[[3-[2-(Pyridin-4-ylmethoxy)phenyl]-1H-pyrazol-4...)
Show SMILES N#Cc1ccc(Oc2cn[nH]c2-c2ccccc2OCc2ccncc2)cc1
Show InChI InChI=1S/C22H16N4O2/c23-13-16-5-7-18(8-6-16)28-21-14-25-26-22(21)19-3-1-2-4-20(19)27-15-17-9-11-24-12-10-17/h1-12,14H,15H2,(H,25,26)
US Patent
n/an/an/an/a 0.00700n/an/an/an/a
Hoffmann-La Roche Inc.
US Patent
Assay Description
G-402 cells can be obtained from ATCC (CRL-1440) and were originally derived from a renal leiomyoblastoma.The expression plasmids contains the ORF fo...
US Patent US9790217 (2017)
BindingDB Entry DOI: 10.7270/Q2K64M6M
Cytochrome P450 11B2 (CYP11B2)
(Homo sapiens (Human))
BDBM347754
(4-[[3-[2-(Pyridin-4-ylmethoxy)phenyl]-1H-pyrazol-4...)
Show SMILES N#Cc1ccc(Oc2cn[nH]c2-c2ccccc2OCc2ccncc2)cc1
Show InChI InChI=1S/C22H16N4O2/c23-13-16-5-7-18(8-6-16)28-21-14-25-26-22(21)19-3-1-2-4-20(19)27-15-17-9-11-24-12-10-17/h1-12,14H,15H2,(H,25,26)
US Patent
n/an/an/an/a 0.000200n/an/an/an/a
Hoffmann-La Roche Inc.
US Patent
Assay Description
G-402 cells can be obtained from ATCC (CRL-1440) and were originally derived from a renal leiomyoblastoma.The expression plasmids contains the ORF fo...
US Patent US9790217 (2017)
BindingDB Entry DOI: 10.7270/Q2K64M6M