BDBM347808 US9790221, Compound 14
SMILES: Cn1cc(cn1)-c1cccc(c1)-c1ncc(-c2cnn(C)c2)c(NC2CCN(CC2)S(C)(=O)=O)n1
InChI Key: InChIKey=DNVKFXDCKNKODH-UHFFFAOYSA-N
Data: 2 IC50
Activity Spreadsheet -- Enzyme Inhibition Constant Data from BindingDB
Found 2 hits for monomerid = 347808
Trg + Lig
Ki
nM
ΔG°
kcal/mole
IC50
nM
Kd
nM
EC50/IC50
nM
koff
s-1
kon
M-1s-1
pHTemp
°C
Interleukin-1 receptor-associated kinase 4
(Homo sapiens (Human))
BDBM347808
(US9790221, Compound 14)
Show SMILES Cn1cc(cn1)-c1cccc(c1)-c1ncc(-c2cnn(C)c2)c(NC2CCN(CC2)S(C)(=O)=O)n1
Show InChI InChI=1S/C24H28N8O2S/c1-30-15-19(12-26-30)17-5-4-6-18(11-17)23-25-14-22(20-13-27-31(2)16-20)24(29-23)28-21-7-9-32(10-8-21)35(3,33)34/h4-6,11-16,21H,7-10H2,1-3H3,(H,25,28,29)
Reactome pathway
US Patent
n/an/a<100n/an/an/an/an/an/a
Merck Patent GmbH
US Patent
Assay Description
IRAK4 is a human purified recombinant enzyme (His-TEV-IRAK1 (194-712). IRAK4 hydrolyses ATP, autophosphorylates and phosphorylates a Serine/Threonine...
US Patent US9790221 (2017)
BindingDB Entry DOI: 10.7270/Q29S1T4F
Interleukin-1 receptor-associated kinase 1 (IRAK1)
(Homo sapiens (Human))
BDBM347808
(US9790221, Compound 14)
Show SMILES Cn1cc(cn1)-c1cccc(c1)-c1ncc(-c2cnn(C)c2)c(NC2CCN(CC2)S(C)(=O)=O)n1
Show InChI InChI=1S/C24H28N8O2S/c1-30-15-19(12-26-30)17-5-4-6-18(11-17)23-25-14-22(20-13-27-31(2)16-20)24(29-23)28-21-7-9-32(10-8-21)35(3,33)34/h4-6,11-16,21H,7-10H2,1-3H3,(H,25,28,29)
US Patent
n/an/a<100n/an/an/an/an/an/a
Merck Patent GmbH
US Patent
Assay Description
IRAK1 is a human purified recombinant enzyme (His-TEV-IRAK1 (194-712)). In this assay, IRAK-1 hydrolyses ATP and autophosphorylates. Measurement of I...
US Patent US9790221 (2017)
BindingDB Entry DOI: 10.7270/Q29S1T4F