null
SMILES: CC(C)Nc1cc(ncc1-c1nnc(s1)C(=O)N1CC[C@H](O)C1)-c1cccc(n1)-c1cnn(C)c1
InChI Key: InChIKey=QDQQVJAKMJJOCH-INIZCTEOSA-N
Activity Spreadsheet -- Enzyme Inhibition Constant Data from BindingDB
Found 2 hits for monomerid = 347816
Trg + Lig
Ki
nM
ΔG°
kcal/mole
IC50
nM
Kd
nM
EC50/IC50
nM
koff
s-1
kon
M-1s-1
pHTemp
°C
Interleukin-1 receptor-associated kinase 4
(Homo sapiens (Human))
BDBM347816
(US9790221, Compound 22)
Show SMILES CC(C)Nc1cc(ncc1-c1nnc(s1)C(=O)N1CC[C@H](O)C1)-c1cccc(n1)-c1cnn(C)c1 |r|
Show InChI InChI=1S/C24H26N8O2S/c1-14(2)27-20-9-21(19-6-4-5-18(28-19)15-10-26-31(3)12-15)25-11-17(20)22-29-30-23(35-22)24(34)32-8-7-16(33)13-32/h4-6,9-12,14,16,33H,7-8,13H2,1-3H3,(H,25,27)/t16-/m0/s1
Reactome pathway
US Patent
n/an/a<100n/an/an/an/an/an/a
Merck Patent GmbH
US Patent
Assay Description
IRAK4 is a human purified recombinant enzyme (His-TEV-IRAK1 (194-712). IRAK4 hydrolyses ATP, autophosphorylates and phosphorylates a Serine/Threonine...
US Patent US9790221 (2017)
BindingDB Entry DOI: 10.7270/Q29S1T4F
Interleukin-1 receptor-associated kinase 1 [194-712]
(Homo sapiens (Human))
BDBM347816
(US9790221, Compound 22)
Show SMILES CC(C)Nc1cc(ncc1-c1nnc(s1)C(=O)N1CC[C@H](O)C1)-c1cccc(n1)-c1cnn(C)c1 |r|
Show InChI InChI=1S/C24H26N8O2S/c1-14(2)27-20-9-21(19-6-4-5-18(28-19)15-10-26-31(3)12-15)25-11-17(20)22-29-30-23(35-22)24(34)32-8-7-16(33)13-32/h4-6,9-12,14,16,33H,7-8,13H2,1-3H3,(H,25,27)/t16-/m0/s1
US Patent
n/an/a 550n/an/an/an/an/an/a
Merck Patent GmbH
US Patent
Assay Description
IRAK1 is a human purified recombinant enzyme (His-TEV-IRAK1 (194-712)). In this assay, IRAK-1 hydrolyses ATP and autophosphorylates. Measurement of I...
US Patent US9790221 (2017)
BindingDB Entry DOI: 10.7270/Q29S1T4F