null
SMILES: Cn1cc(cn1)-c1cccc(c1)-c1ncc(-c2cnn(C)c2)c(NC2CC2)n1
InChI Key: InChIKey=SDMRQHXJQFKDHV-UHFFFAOYSA-N
Activity Spreadsheet -- Enzyme Inhibition Constant Data from BindingDB
Found 2 hits for monomerid = 347824
Trg + Lig
Ki
nM
ΔG°
kcal/mole
IC50
nM
Kd
nM
EC50/IC50
nM
koff
s-1
kon
M-1s-1
pHTemp
°C
Interleukin-1 receptor-associated kinase 4
(Homo sapiens (Human))
BDBM347824
(US9790221, Compound 30)
Show SMILES Cn1cc(cn1)-c1cccc(c1)-c1ncc(-c2cnn(C)c2)c(NC2CC2)n1
Show InChI InChI=1S/C21H21N7/c1-27-12-16(9-23-27)14-4-3-5-15(8-14)20-22-11-19(17-10-24-28(2)13-17)21(26-20)25-18-6-7-18/h3-5,8-13,18H,6-7H2,1-2H3,(H,22,25,26)
Reactome pathway
US Patent
n/an/a 550n/an/an/an/an/an/a
Merck Patent GmbH
US Patent
Assay Description
IRAK4 is a human purified recombinant enzyme (His-TEV-IRAK1 (194-712). IRAK4 hydrolyses ATP, autophosphorylates and phosphorylates a Serine/Threonine...
US Patent US9790221 (2017)
BindingDB Entry DOI: 10.7270/Q29S1T4F
Interleukin-1 receptor-associated kinase 1 [194-712]
(Homo sapiens (Human))
BDBM347824
(US9790221, Compound 30)
Show SMILES Cn1cc(cn1)-c1cccc(c1)-c1ncc(-c2cnn(C)c2)c(NC2CC2)n1
Show InChI InChI=1S/C21H21N7/c1-27-12-16(9-23-27)14-4-3-5-15(8-14)20-22-11-19(17-10-24-28(2)13-17)21(26-20)25-18-6-7-18/h3-5,8-13,18H,6-7H2,1-2H3,(H,22,25,26)
US Patent
n/an/a 550n/an/an/an/an/an/a
Merck Patent GmbH
US Patent
Assay Description
IRAK1 is a human purified recombinant enzyme (His-TEV-IRAK1 (194-712)). In this assay, IRAK-1 hydrolyses ATP and autophosphorylates. Measurement of I...
US Patent US9790221 (2017)
BindingDB Entry DOI: 10.7270/Q29S1T4F