BDBM3480 1-(4-chlorophenyl)-3-[6-(2,6-dichlorophenyl)-2-{[3-(4-methylpiperazin-1-yl)propyl]amino}pyrido[2,3-d]pyrimidin-7-yl]urea::6-arylpyrido[2,3-d]pyrimidine deriv. 62
SMILES: CN1CCN(CCCNc2ncc3cc(c(NC(=O)Nc4ccc(Cl)cc4)nc3n2)-c2c(Cl)cccc2Cl)CC1
InChI Key: InChIKey=JEPFUEYLCGNLKG-UHFFFAOYSA-N
Data: 3 IC50
Activity Spreadsheet -- Enzyme Inhibition Constant Data from BindingDB
Found 3 hits for monomerid = 3480
Trg + Lig
Ki
nM
ΔG°
kcal/mole
IC50
nM
Kd
nM
EC50/IC50
nM
koff
s-1
kon
M-1s-1
pHTemp
°C
Platelet-derived growth factor receptor beta
(Homo sapiens (Human))
BDBM3480
(1-(4-chlorophenyl)-3-[6-(2,6-dichlorophenyl)-2-{[3...)
Show SMILES CN1CCN(CCCNc2ncc3cc(c(NC(=O)Nc4ccc(Cl)cc4)nc3n2)-c2c(Cl)cccc2Cl)CC1 |(10.23,-16.39,;11.56,-15.62,;11.63,-14.08,;13,-13.38,;14.29,-14.21,;15.78,-13.81,;16.87,-14.9,;18.36,-14.5,;19.69,-15.27,;21.03,-14.5,;21.03,-12.96,;22.36,-12.19,;23.69,-12.96,;25.03,-12.19,;26.36,-12.96,;26.36,-14.5,;27.69,-15.27,;27.69,-16.81,;26.36,-17.58,;29.03,-17.58,;29.03,-19.12,;27.67,-19.85,;27.62,-21.39,;28.93,-22.2,;28.88,-23.74,;30.29,-21.47,;30.34,-19.93,;25.03,-15.27,;23.69,-14.5,;22.36,-15.27,;27.69,-12.19,;27.69,-10.65,;26.36,-9.88,;29.03,-9.88,;30.36,-10.65,;30.36,-12.19,;29.03,-12.96,;29.03,-14.5,;14.22,-15.75,;12.86,-16.45,)|
Show InChI InChI=1S/C28H29Cl3N8O/c1-38-12-14-39(15-13-38)11-3-10-32-27-33-17-18-16-21(24-22(30)4-2-5-23(24)31)26(35-25(18)36-27)37-28(40)34-20-8-6-19(29)7-9-20/h2,4-9,16-17H,3,10-15H2,1H3,(H3,32,33,34,35,36,37,40)
NCI pathway
Reactome pathway
n/an/a 1.80E+3n/an/an/an/an/an/a
Pfizer
Assay Description
IC50 is the inhibitor concentration which inhibits 50% of kinase activity that catalyzes the transfer of the terminal phosphate from [gamma-32P] labe...
J Med Chem 44: 1915-26 (2001)
Article DOI: 10.1021/jm0004291
BindingDB Entry DOI: 10.7270/Q29K48DG
Proto-oncogene tyrosine-protein kinase Src
(Homo sapiens (Human))
BDBM3480
(1-(4-chlorophenyl)-3-[6-(2,6-dichlorophenyl)-2-{[3...)
Show SMILES CN1CCN(CCCNc2ncc3cc(c(NC(=O)Nc4ccc(Cl)cc4)nc3n2)-c2c(Cl)cccc2Cl)CC1 |(10.23,-16.39,;11.56,-15.62,;11.63,-14.08,;13,-13.38,;14.29,-14.21,;15.78,-13.81,;16.87,-14.9,;18.36,-14.5,;19.69,-15.27,;21.03,-14.5,;21.03,-12.96,;22.36,-12.19,;23.69,-12.96,;25.03,-12.19,;26.36,-12.96,;26.36,-14.5,;27.69,-15.27,;27.69,-16.81,;26.36,-17.58,;29.03,-17.58,;29.03,-19.12,;27.67,-19.85,;27.62,-21.39,;28.93,-22.2,;28.88,-23.74,;30.29,-21.47,;30.34,-19.93,;25.03,-15.27,;23.69,-14.5,;22.36,-15.27,;27.69,-12.19,;27.69,-10.65,;26.36,-9.88,;29.03,-9.88,;30.36,-10.65,;30.36,-12.19,;29.03,-12.96,;29.03,-14.5,;14.22,-15.75,;12.86,-16.45,)|
Show InChI InChI=1S/C28H29Cl3N8O/c1-38-12-14-39(15-13-38)11-3-10-32-27-33-17-18-16-21(24-22(30)4-2-5-23(24)31)26(35-25(18)36-27)37-28(40)34-20-8-6-19(29)7-9-20/h2,4-9,16-17H,3,10-15H2,1H3,(H3,32,33,34,35,36,37,40)
n/an/a 40n/an/an/an/an/an/a
Pfizer
Assay Description
IC50 is the inhibitor concentration which inhibits 50% of kinase activity that catalyzes the transfer of the terminal phosphate from [gamma-32P] labe...
J Med Chem 44: 1915-26 (2001)
Article DOI: 10.1021/jm0004291
BindingDB Entry DOI: 10.7270/Q29K48DG
Fibroblast growth factor receptor 1
(Homo sapiens (Human))
BDBM3480
(1-(4-chlorophenyl)-3-[6-(2,6-dichlorophenyl)-2-{[3...)
Show SMILES CN1CCN(CCCNc2ncc3cc(c(NC(=O)Nc4ccc(Cl)cc4)nc3n2)-c2c(Cl)cccc2Cl)CC1 |(10.23,-16.39,;11.56,-15.62,;11.63,-14.08,;13,-13.38,;14.29,-14.21,;15.78,-13.81,;16.87,-14.9,;18.36,-14.5,;19.69,-15.27,;21.03,-14.5,;21.03,-12.96,;22.36,-12.19,;23.69,-12.96,;25.03,-12.19,;26.36,-12.96,;26.36,-14.5,;27.69,-15.27,;27.69,-16.81,;26.36,-17.58,;29.03,-17.58,;29.03,-19.12,;27.67,-19.85,;27.62,-21.39,;28.93,-22.2,;28.88,-23.74,;30.29,-21.47,;30.34,-19.93,;25.03,-15.27,;23.69,-14.5,;22.36,-15.27,;27.69,-12.19,;27.69,-10.65,;26.36,-9.88,;29.03,-9.88,;30.36,-10.65,;30.36,-12.19,;29.03,-12.96,;29.03,-14.5,;14.22,-15.75,;12.86,-16.45,)|
Show InChI InChI=1S/C28H29Cl3N8O/c1-38-12-14-39(15-13-38)11-3-10-32-27-33-17-18-16-21(24-22(30)4-2-5-23(24)31)26(35-25(18)36-27)37-28(40)34-20-8-6-19(29)7-9-20/h2,4-9,16-17H,3,10-15H2,1H3,(H3,32,33,34,35,36,37,40)
NCI pathway
Reactome pathway
n/an/a 120n/an/an/an/an/an/a
Pfizer
Assay Description
IC50 is the inhibitor concentration which inhibits 50% of kinase activity that catalyzes the transfer of the terminal phosphate from [gamma-32P] labe...
J Med Chem 44: 1915-26 (2001)
Article DOI: 10.1021/jm0004291
BindingDB Entry DOI: 10.7270/Q29K48DG