BDBM348155 US9790228, Compound 74
SMILES: CN1CCN(CC1)c1nc2ccccc2cc1Cn1nc(-c2cnc3[nH]ccc3c2)c2c(N)ncnc12
InChI Key: InChIKey=MTNQKDNCUOSODY-UHFFFAOYSA-N
Data: 4 IC50
Activity Spreadsheet -- Enzyme Inhibition Constant Data from BindingDB
Found 4 hits for monomerid = 348155
Trg + Lig
Ki
nM
ΔG°
kcal/mole
IC50
nM
Kd
nM
EC50/IC50
nM
koff
s-1
kon
M-1s-1
pHTemp
°C
Phosphatidylinositol 4,5-bisphosphate 3-kinase catalytic subunit delta isoform
(Homo sapiens (Human))
BDBM348155
(US9790228, Compound 74)
Show SMILES CN1CCN(CC1)c1nc2ccccc2cc1Cn1nc(-c2cnc3[nH]ccc3c2)c2c(N)ncnc12
Show InChI InChI=1S/C27H26N10/c1-35-8-10-36(11-9-35)26-20(12-17-4-2-3-5-21(17)33-26)15-37-27-22(24(28)31-16-32-27)23(34-37)19-13-18-6-7-29-25(18)30-14-19/h2-7,12-14,16H,8-11,15H2,1H3,(H,29,30)(H2,28,31,32)
NCI pathway
Reactome pathway
US Patent
n/an/a<100n/an/an/an/an/an/a
Intellikine LLC
US Patent
Assay Description
Class I PI3-Ks can be either purchased (p110α/p85α, p110β/p85α, p110δ/p85α from Upstate, and p110γ from Sigma) or ...
US Patent US9790228 (2017)
BindingDB Entry DOI: 10.7270/Q26112FV
Phosphatidylinositol 4-phosphate 3-kinase C2 domain-containing subunit beta
(Homo sapiens (Human))
BDBM348155
(US9790228, Compound 74)
Show SMILES CN1CCN(CC1)c1nc2ccccc2cc1Cn1nc(-c2cnc3[nH]ccc3c2)c2c(N)ncnc12
Show InChI InChI=1S/C27H26N10/c1-35-8-10-36(11-9-35)26-20(12-17-4-2-3-5-21(17)33-26)15-37-27-22(24(28)31-16-32-27)23(34-37)19-13-18-6-7-29-25(18)30-14-19/h2-7,12-14,16H,8-11,15H2,1H3,(H,29,30)(H2,28,31,32)
NCI pathway
Reactome pathway
US Patent
n/an/a 550n/an/an/an/an/an/a
Intellikine LLC
US Patent
Assay Description
Class I PI3-Ks can be either purchased (p110α/p85α, p110β/p85α, p110δ/p85α from Upstate, and p110γ from Sigma) or ...
US Patent US9790228 (2017)
BindingDB Entry DOI: 10.7270/Q26112FV
PI3-kinase class I
(Homo sapiens (Human))
BDBM348155
(US9790228, Compound 74)
Show SMILES CN1CCN(CC1)c1nc2ccccc2cc1Cn1nc(-c2cnc3[nH]ccc3c2)c2c(N)ncnc12
Show InChI InChI=1S/C27H26N10/c1-35-8-10-36(11-9-35)26-20(12-17-4-2-3-5-21(17)33-26)15-37-27-22(24(28)31-16-32-27)23(34-37)19-13-18-6-7-29-25(18)30-14-19/h2-7,12-14,16H,8-11,15H2,1H3,(H,29,30)(H2,28,31,32)
US Patent
n/an/a>1.00E+3n/an/an/an/an/an/a
Intellikine LLC
US Patent
Assay Description
Class I PI3-Ks can be either purchased (p110α/p85α, p110β/p85α, p110δ/p85α from Upstate, and p110γ from Sigma) or ...
US Patent US9790228 (2017)
BindingDB Entry DOI: 10.7270/Q26112FV
Phosphatidylinositol 4,5-bisphosphate 3-kinase catalytic subunit gamma isoform
(Homo sapiens (Human))
BDBM348155
(US9790228, Compound 74)
Show SMILES CN1CCN(CC1)c1nc2ccccc2cc1Cn1nc(-c2cnc3[nH]ccc3c2)c2c(N)ncnc12
Show InChI InChI=1S/C27H26N10/c1-35-8-10-36(11-9-35)26-20(12-17-4-2-3-5-21(17)33-26)15-37-27-22(24(28)31-16-32-27)23(34-37)19-13-18-6-7-29-25(18)30-14-19/h2-7,12-14,16H,8-11,15H2,1H3,(H,29,30)(H2,28,31,32)
NCI pathway
Reactome pathway
US Patent
n/an/a>1.00E+3n/an/an/an/an/an/a
Intellikine LLC
US Patent
Assay Description
Class I PI3-Ks can be either purchased (p110α/p85α, p110β/p85α, p110δ/p85α from Upstate, and p110γ from Sigma) or ...
US Patent US9790228 (2017)
BindingDB Entry DOI: 10.7270/Q26112FV