BDBM349325 US10207991, Ex. Cpd. No. 9::US10611728, Example Compound 9
SMILES: C[C@H](CCc1ccc(Cl)c(Cl)c1)N1Cc2cccc(F)c2C1
InChI Key: InChIKey=ZIDKNUHPKSUTKP-GFCCVEGCSA-N
Data: 6 KI  1 IC50
Activity Spreadsheet -- Enzyme Inhibition Constant Data from BindingDB
Found 7 hits for monomerid = 349325
Trg + Lig
Ki
nM
ΔG°
kcal/mole
IC50
nM
Kd
nM
EC50/IC50
nM
koff
s-1
kon
M-1s-1
pHTemp
°C
Sigma intracellular receptor 2
(Homo sapiens (Human))
BDBM349325
(US10207991, Ex. Cpd. No. 9 | US10611728, Example C...)
Show SMILES C[C@H](CCc1ccc(Cl)c(Cl)c1)N1Cc2cccc(F)c2C1 |r|
Show InChI InChI=1S/C18H18Cl2FN/c1-12(5-6-13-7-8-16(19)17(20)9-13)22-10-14-3-2-4-18(21)15(14)11-22/h2-4,7-9,12H,5-6,10-11H2,1H3/t12-/m1/s1
US Patent
3.60n/an/an/an/an/an/an/an/a
COGNITION THERAPEUTICS, INC.
US Patent
Assay Description
Radioligand binding assays for Sigma-1 receptors and Sigma-2 receptors were carried out by a commercial contract research organization. For Sigma-1 b...
US Patent US9796672 (2017)
BindingDB Entry DOI: 10.7270/Q2X92DFN
Sigma intracellular receptor 2
(Homo sapiens (Human))
BDBM349325
(US10207991, Ex. Cpd. No. 9 | US10611728, Example C...)
Show SMILES C[C@H](CCc1ccc(Cl)c(Cl)c1)N1Cc2cccc(F)c2C1 |r|
Show InChI InChI=1S/C18H18Cl2FN/c1-12(5-6-13-7-8-16(19)17(20)9-13)22-10-14-3-2-4-18(21)15(14)11-22/h2-4,7-9,12H,5-6,10-11H2,1H3/t12-/m1/s1
US Patent
3.60n/an/an/an/an/an/an/an/a
COGNITION THERAPEUTICS, INC.
US Patent
Assay Description
Radioligand binding assays for Sigma-1 receptors and Sigma-2 receptors were carried out by a commercial contract research organization. For Sigma-1 b...
US Patent US10611728 (2020)
Sigma intracellular receptor 2
(Homo sapiens (Human))
BDBM349325
(US10207991, Ex. Cpd. No. 9 | US10611728, Example C...)
Show SMILES C[C@H](CCc1ccc(Cl)c(Cl)c1)N1Cc2cccc(F)c2C1 |r|
Show InChI InChI=1S/C18H18Cl2FN/c1-12(5-6-13-7-8-16(19)17(20)9-13)22-10-14-3-2-4-18(21)15(14)11-22/h2-4,7-9,12H,5-6,10-11H2,1H3/t12-/m1/s1
US Patent
3.60n/an/an/an/an/an/an/an/a
COGNITION THERAPEUTICS, INC.
US Patent
Assay Description
The affinity of candidate sigma-2 ligand compounds at sigma-1 and sigma-2 receptors was also determined by displacement of different known labeled si...
US Patent US10207991 (2019)
BindingDB Entry DOI: 10.7270/Q2BV7JRG
Sigma non-opioid intracellular receptor 1
(Homo sapiens (Human))
BDBM349325
(US10207991, Ex. Cpd. No. 9 | US10611728, Example C...)
Show SMILES C[C@H](CCc1ccc(Cl)c(Cl)c1)N1Cc2cccc(F)c2C1 |r|
Show InChI InChI=1S/C18H18Cl2FN/c1-12(5-6-13-7-8-16(19)17(20)9-13)22-10-14-3-2-4-18(21)15(14)11-22/h2-4,7-9,12H,5-6,10-11H2,1H3/t12-/m1/s1
US Patent
17n/an/an/an/an/an/an/an/a
COGNITION THERAPEUTICS, INC.
US Patent
Assay Description
Radioligand binding assays for Sigma-1 receptors and Sigma-2 receptors were carried out by a commercial contract research organization. For Sigma-1 b...
US Patent US9796672 (2017)
BindingDB Entry DOI: 10.7270/Q2X92DFN
Sigma non-opioid intracellular receptor 1
(Homo sapiens (Human))
BDBM349325
(US10207991, Ex. Cpd. No. 9 | US10611728, Example C...)
Show SMILES C[C@H](CCc1ccc(Cl)c(Cl)c1)N1Cc2cccc(F)c2C1 |r|
Show InChI InChI=1S/C18H18Cl2FN/c1-12(5-6-13-7-8-16(19)17(20)9-13)22-10-14-3-2-4-18(21)15(14)11-22/h2-4,7-9,12H,5-6,10-11H2,1H3/t12-/m1/s1
US Patent
17n/an/an/an/an/an/an/an/a
COGNITION THERAPEUTICS, INC.
US Patent
Assay Description
Radioligand binding assays for Sigma-1 receptors and Sigma-2 receptors were carried out by a commercial contract research organization. For Sigma-1 b...
US Patent US10611728 (2020)
Sigma non-opioid intracellular receptor 1
(Homo sapiens (Human))
BDBM349325
(US10207991, Ex. Cpd. No. 9 | US10611728, Example C...)
Show SMILES C[C@H](CCc1ccc(Cl)c(Cl)c1)N1Cc2cccc(F)c2C1 |r|
Show InChI InChI=1S/C18H18Cl2FN/c1-12(5-6-13-7-8-16(19)17(20)9-13)22-10-14-3-2-4-18(21)15(14)11-22/h2-4,7-9,12H,5-6,10-11H2,1H3/t12-/m1/s1
US Patent
17n/an/an/an/an/an/an/an/a
COGNITION THERAPEUTICS, INC.
US Patent
Assay Description
The affinity of candidate sigma-2 ligand compounds at sigma-1 and sigma-2 receptors was also determined by displacement of different known labeled si...
US Patent US10207991 (2019)
BindingDB Entry DOI: 10.7270/Q2BV7JRG
Potassium voltage-gated channel subfamily H member 2
(Homo sapiens (Human))
BDBM349325
(US10207991, Ex. Cpd. No. 9 | US10611728, Example C...)
Show SMILES C[C@H](CCc1ccc(Cl)c(Cl)c1)N1Cc2cccc(F)c2C1 |r|
Show InChI InChI=1S/C18H18Cl2FN/c1-12(5-6-13-7-8-16(19)17(20)9-13)22-10-14-3-2-4-18(21)15(14)11-22/h2-4,7-9,12H,5-6,10-11H2,1H3/t12-/m1/s1
Reactome pathway
US Patent
n/an/a 6.70E+3n/an/an/an/an/an/a
COGNITION THERAPEUTICS, INC.
US Patent
Assay Description
Representative sigma-2 antagonists test compounds do not induce neuronal or glial toxicity with acute or chronic dosing in vitro. The sigma-2 recepto...
US Patent US10611728 (2020)