BDBM349505 US10207991, Ex. Cpd. No. 20::US10611728, Example Compound 20
SMILES: COc1cc2CN(Cc2cc1OC)[C@@H](C)CCc1ccc(Cl)c(Cl)c1
InChI Key: InChIKey=QOXCLDKXSCBOOF-ZDUSSCGKSA-N
Data: 6 KI  1 IC50
Activity Spreadsheet -- Enzyme Inhibition Constant Data from BindingDB
Found 7 hits for monomerid = 349505
Trg + Lig
Ki
nM
ΔG°
kcal/mole
IC50
nM
Kd
nM
EC50/IC50
nM
koff
s-1
kon
M-1s-1
pHTemp
°C
Sigma non-opioid intracellular receptor 1
(Homo sapiens (Human))
BDBM349505
(US10207991, Ex. Cpd. No. 20 | US10611728, Example ...)
Show SMILES COc1cc2CN(Cc2cc1OC)[C@@H](C)CCc1ccc(Cl)c(Cl)c1 |r|
Show InChI InChI=1S/C20H23Cl2NO2/c1-13(4-5-14-6-7-17(21)18(22)8-14)23-11-15-9-19(24-2)20(25-3)10-16(15)12-23/h6-10,13H,4-5,11-12H2,1-3H3/t13-/m0/s1
US Patent
0.570n/an/an/an/an/an/an/an/a
COGNITION THERAPEUTICS, INC.
US Patent
Assay Description
Radioligand binding assays for Sigma-1 receptors and Sigma-2 receptors were carried out by a commercial contract research organization. For Sigma-1 b...
US Patent US10611728 (2020)
Sigma non-opioid intracellular receptor 1
(Homo sapiens (Human))
BDBM349505
(US10207991, Ex. Cpd. No. 20 | US10611728, Example ...)
Show SMILES COc1cc2CN(Cc2cc1OC)[C@@H](C)CCc1ccc(Cl)c(Cl)c1 |r|
Show InChI InChI=1S/C20H23Cl2NO2/c1-13(4-5-14-6-7-17(21)18(22)8-14)23-11-15-9-19(24-2)20(25-3)10-16(15)12-23/h6-10,13H,4-5,11-12H2,1-3H3/t13-/m0/s1
US Patent
0.570n/an/an/an/an/an/an/an/a
COGNITION THERAPEUTICS, INC.
US Patent
Assay Description
The affinity of candidate sigma-2 ligand compounds at sigma-1 and sigma-2 receptors was also determined by displacement of different known labeled si...
US Patent US10207991 (2019)
BindingDB Entry DOI: 10.7270/Q2BV7JRG
Sigma non-opioid intracellular receptor 1
(Homo sapiens (Human))
BDBM349505
(US10207991, Ex. Cpd. No. 20 | US10611728, Example ...)
Show SMILES COc1cc2CN(Cc2cc1OC)[C@@H](C)CCc1ccc(Cl)c(Cl)c1 |r|
Show InChI InChI=1S/C20H23Cl2NO2/c1-13(4-5-14-6-7-17(21)18(22)8-14)23-11-15-9-19(24-2)20(25-3)10-16(15)12-23/h6-10,13H,4-5,11-12H2,1-3H3/t13-/m0/s1
US Patent
0.570n/an/an/an/an/an/an/an/a
COGNITION THERAPEUTICS, INC.
US Patent
Assay Description
Radioligand binding assays for Sigma-1 receptors and Sigma-2 receptors were carried out by a commercial contract research organization. For Sigma-1 b...
US Patent US9796672 (2017)
BindingDB Entry DOI: 10.7270/Q2X92DFN
Sigma intracellular receptor 2
(Homo sapiens (Human))
BDBM349505
(US10207991, Ex. Cpd. No. 20 | US10611728, Example ...)
Show SMILES COc1cc2CN(Cc2cc1OC)[C@@H](C)CCc1ccc(Cl)c(Cl)c1 |r|
Show InChI InChI=1S/C20H23Cl2NO2/c1-13(4-5-14-6-7-17(21)18(22)8-14)23-11-15-9-19(24-2)20(25-3)10-16(15)12-23/h6-10,13H,4-5,11-12H2,1-3H3/t13-/m0/s1
US Patent
0.670n/an/an/an/an/an/an/an/a
COGNITION THERAPEUTICS, INC.
US Patent
Assay Description
The affinity of candidate sigma-2 ligand compounds at sigma-1 and sigma-2 receptors was also determined by displacement of different known labeled si...
US Patent US10207991 (2019)
BindingDB Entry DOI: 10.7270/Q2BV7JRG
Sigma intracellular receptor 2
(Homo sapiens (Human))
BDBM349505
(US10207991, Ex. Cpd. No. 20 | US10611728, Example ...)
Show SMILES COc1cc2CN(Cc2cc1OC)[C@@H](C)CCc1ccc(Cl)c(Cl)c1 |r|
Show InChI InChI=1S/C20H23Cl2NO2/c1-13(4-5-14-6-7-17(21)18(22)8-14)23-11-15-9-19(24-2)20(25-3)10-16(15)12-23/h6-10,13H,4-5,11-12H2,1-3H3/t13-/m0/s1
US Patent
0.670n/an/an/an/an/an/an/an/a
COGNITION THERAPEUTICS, INC.
US Patent
Assay Description
Radioligand binding assays for Sigma-1 receptors and Sigma-2 receptors were carried out by a commercial contract research organization. For Sigma-1 b...
US Patent US9796672 (2017)
BindingDB Entry DOI: 10.7270/Q2X92DFN
Sigma intracellular receptor 2
(Homo sapiens (Human))
BDBM349505
(US10207991, Ex. Cpd. No. 20 | US10611728, Example ...)
Show SMILES COc1cc2CN(Cc2cc1OC)[C@@H](C)CCc1ccc(Cl)c(Cl)c1 |r|
Show InChI InChI=1S/C20H23Cl2NO2/c1-13(4-5-14-6-7-17(21)18(22)8-14)23-11-15-9-19(24-2)20(25-3)10-16(15)12-23/h6-10,13H,4-5,11-12H2,1-3H3/t13-/m0/s1
US Patent
0.670n/an/an/an/an/an/an/an/a
COGNITION THERAPEUTICS, INC.
US Patent
Assay Description
Radioligand binding assays for Sigma-1 receptors and Sigma-2 receptors were carried out by a commercial contract research organization. For Sigma-1 b...
US Patent US10611728 (2020)
Melanin-concentrating hormone receptor 2/HERG
(Homo sapiens (Human))
BDBM349505
(US10207991, Ex. Cpd. No. 20 | US10611728, Example ...)
Show SMILES COc1cc2CN(Cc2cc1OC)[C@@H](C)CCc1ccc(Cl)c(Cl)c1 |r|
Show InChI InChI=1S/C20H23Cl2NO2/c1-13(4-5-14-6-7-17(21)18(22)8-14)23-11-15-9-19(24-2)20(25-3)10-16(15)12-23/h6-10,13H,4-5,11-12H2,1-3H3/t13-/m0/s1
Reactome pathway
US Patent
n/an/a 660n/an/an/an/an/an/a
COGNITION THERAPEUTICS, INC.
US Patent
Assay Description
Representative sigma-2 antagonists test compounds do not induce neuronal or glial toxicity with acute or chronic dosing in vitro. The sigma-2 recepto...
US Patent US10611728 (2020)