BDBM349532 US10207991, Ex. Cpd. No. 48::US10611728, Example Compound 48
SMILES: COc1cc2CN(Cc2cc1OC)C(C)(C)CCc1ccc(OCCO)c(OC)c1
InChI Key: InChIKey=NCOSYNYFDVJQLU-UHFFFAOYSA-N
Data: 6 KI  1 IC50
Activity Spreadsheet -- Enzyme Inhibition Constant Data from BindingDB
Found 7 hits for monomerid = 349532
Trg + Lig
Ki
nM
ΔG°
kcal/mole
IC50
nM
Kd
nM
EC50/IC50
nM
koff
s-1
kon
M-1s-1
pHTemp
°C
Sigma intracellular receptor 2
(Homo sapiens (Human))
BDBM349532
(US10207991, Ex. Cpd. No. 48 | US10611728, Example ...)
Show SMILES COc1cc2CN(Cc2cc1OC)C(C)(C)CCc1ccc(OCCO)c(OC)c1
Show InChI InChI=1S/C24H33NO5/c1-24(2,9-8-17-6-7-20(30-11-10-26)21(12-17)27-3)25-15-18-13-22(28-4)23(29-5)14-19(18)16-25/h6-7,12-14,26H,8-11,15-16H2,1-5H3
US Patent
22n/an/an/an/an/an/an/an/a
COGNITION THERAPEUTICS, INC.
US Patent
Assay Description
Radioligand binding assays for Sigma-1 receptors and Sigma-2 receptors were carried out by a commercial contract research organization. For Sigma-1 b...
US Patent US9796672 (2017)
BindingDB Entry DOI: 10.7270/Q2X92DFN
Sigma intracellular receptor 2
(Homo sapiens (Human))
BDBM349532
(US10207991, Ex. Cpd. No. 48 | US10611728, Example ...)
Show SMILES COc1cc2CN(Cc2cc1OC)C(C)(C)CCc1ccc(OCCO)c(OC)c1
Show InChI InChI=1S/C24H33NO5/c1-24(2,9-8-17-6-7-20(30-11-10-26)21(12-17)27-3)25-15-18-13-22(28-4)23(29-5)14-19(18)16-25/h6-7,12-14,26H,8-11,15-16H2,1-5H3
US Patent
22n/an/an/an/an/an/an/an/a
COGNITION THERAPEUTICS, INC.
US Patent
Assay Description
Radioligand binding assays for Sigma-1 receptors and Sigma-2 receptors were carried out by a commercial contract research organization. For Sigma-1 b...
US Patent US10611728 (2020)
Sigma intracellular receptor 2
(Homo sapiens (Human))
BDBM349532
(US10207991, Ex. Cpd. No. 48 | US10611728, Example ...)
Show SMILES COc1cc2CN(Cc2cc1OC)C(C)(C)CCc1ccc(OCCO)c(OC)c1
Show InChI InChI=1S/C24H33NO5/c1-24(2,9-8-17-6-7-20(30-11-10-26)21(12-17)27-3)25-15-18-13-22(28-4)23(29-5)14-19(18)16-25/h6-7,12-14,26H,8-11,15-16H2,1-5H3
US Patent
22n/an/an/an/an/an/an/an/a
COGNITION THERAPEUTICS, INC.
US Patent
Assay Description
The affinity of candidate sigma-2 ligand compounds at sigma-1 and sigma-2 receptors was also determined by displacement of different known labeled si...
US Patent US10207991 (2019)
BindingDB Entry DOI: 10.7270/Q2BV7JRG
Sigma non-opioid intracellular receptor 1
(Homo sapiens (Human))
BDBM349532
(US10207991, Ex. Cpd. No. 48 | US10611728, Example ...)
Show SMILES COc1cc2CN(Cc2cc1OC)C(C)(C)CCc1ccc(OCCO)c(OC)c1
Show InChI InChI=1S/C24H33NO5/c1-24(2,9-8-17-6-7-20(30-11-10-26)21(12-17)27-3)25-15-18-13-22(28-4)23(29-5)14-19(18)16-25/h6-7,12-14,26H,8-11,15-16H2,1-5H3
US Patent
3.60E+3n/an/an/an/an/an/an/an/a
COGNITION THERAPEUTICS, INC.
US Patent
Assay Description
Radioligand binding assays for Sigma-1 receptors and Sigma-2 receptors were carried out by a commercial contract research organization. For Sigma-1 b...
US Patent US9796672 (2017)
BindingDB Entry DOI: 10.7270/Q2X92DFN
Sigma non-opioid intracellular receptor 1
(Homo sapiens (Human))
BDBM349532
(US10207991, Ex. Cpd. No. 48 | US10611728, Example ...)
Show SMILES COc1cc2CN(Cc2cc1OC)C(C)(C)CCc1ccc(OCCO)c(OC)c1
Show InChI InChI=1S/C24H33NO5/c1-24(2,9-8-17-6-7-20(30-11-10-26)21(12-17)27-3)25-15-18-13-22(28-4)23(29-5)14-19(18)16-25/h6-7,12-14,26H,8-11,15-16H2,1-5H3
US Patent
3.60E+3n/an/an/an/an/an/an/an/a
COGNITION THERAPEUTICS, INC.
US Patent
Assay Description
Radioligand binding assays for Sigma-1 receptors and Sigma-2 receptors were carried out by a commercial contract research organization. For Sigma-1 b...
US Patent US10611728 (2020)
Sigma non-opioid intracellular receptor 1
(Homo sapiens (Human))
BDBM349532
(US10207991, Ex. Cpd. No. 48 | US10611728, Example ...)
Show SMILES COc1cc2CN(Cc2cc1OC)C(C)(C)CCc1ccc(OCCO)c(OC)c1
Show InChI InChI=1S/C24H33NO5/c1-24(2,9-8-17-6-7-20(30-11-10-26)21(12-17)27-3)25-15-18-13-22(28-4)23(29-5)14-19(18)16-25/h6-7,12-14,26H,8-11,15-16H2,1-5H3
US Patent
3.60E+3n/an/an/an/an/an/an/an/a
COGNITION THERAPEUTICS, INC.
US Patent
Assay Description
The affinity of candidate sigma-2 ligand compounds at sigma-1 and sigma-2 receptors was also determined by displacement of different known labeled si...
US Patent US10207991 (2019)
BindingDB Entry DOI: 10.7270/Q2BV7JRG
Melanin-concentrating hormone receptor 2/HERG
(Homo sapiens (Human))
BDBM349532
(US10207991, Ex. Cpd. No. 48 | US10611728, Example ...)
Show SMILES COc1cc2CN(Cc2cc1OC)C(C)(C)CCc1ccc(OCCO)c(OC)c1
Show InChI InChI=1S/C24H33NO5/c1-24(2,9-8-17-6-7-20(30-11-10-26)21(12-17)27-3)25-15-18-13-22(28-4)23(29-5)14-19(18)16-25/h6-7,12-14,26H,8-11,15-16H2,1-5H3
Reactome pathway
US Patent
n/an/a 1.70E+3n/an/an/an/an/an/a
COGNITION THERAPEUTICS, INC.
US Patent
Assay Description
Representative sigma-2 antagonists test compounds do not induce neuronal or glial toxicity with acute or chronic dosing in vitro. The sigma-2 recepto...
US Patent US10611728 (2020)